{"text_format":"1","workbook":"xlsx","n_sheets":4,"sheets":["Gesuch","Vertretung","GPU001","GPU004"],"not_rendered":{"charts":0,"images":0,"macros":1,"external_links":0,"defined_names":3,"comments":0,"pivot_tables":0},"unopened":[],"bounds":{"document_bytes":16777216,"sheet_cells":100000,"rows_first":2000,"rows_last":500,"rows_between":2000,"halvings":0,"cell_chars":16384,"cell_head_chars":4096},"cells_cut":0,"cells_raw":0,"read":"whole","date_system":"1900"}

{"sheet":"Gesuch","index":0,"n_rows":63,"n_cols":24,"rows_kept":63,"cut":false,"hidden":false,"merged":[[5,14,5,23],[37,17,37,23],[10,7,10,8],[10,14,10,15],[25,17,25,23],[35,7,35,23],[12,14,12,23],[14,14,14,23],[16,14,16,23],[18,14,18,23],[33,7,33,23],[37,7,37,8],[20,14,20,23],[58,7,58,8],[58,17,58,23],[27,17,27,23],[29,17,29,23],[31,17,31,23],[46,14,46,15],[54,7,54,23],[56,7,56,23],[46,7,46,8],[48,7,48,23],[43,14,43,23]]}
["mail@kssursee.ch;stundenplaner@kssursee.ch",null,"Kantonsschule Sursee",null,null,null,null,null,null,null,null,null,null,null,null,null,null,null,null,null,null,null,null,"Urlaubsgesuch"]
[]
[null,null,"URLAUB FÜR LEHRPERSONEN"]
[]
[null,null,null,null,null,null,null,"Kürzel",null,null,null,null,null,null,"Name, Vorname"]
[null,null,"Lehrperson",null,null,null,null,null,null,null,null,null,null,null,{"$f":"IF(ISERROR(VLOOKUP(H6,'GPU004'!A:B,2,FALSE)),\"\",VLOOKUP(H6,'GPU004'!A:B,2,FALSE))","v":""}]
[]
[null,null,"wünscht Urlaub für",null,null,null,null,null,"Tag(e)",null,null,null,null,null,null,"Stunde(n)"]
[]
[null,null,null,null,null,null,null,"Datum",null,null,"Std",null,null,null,"Datum",null,null,"Std",null,null,null,null,null,"Abgabetermin"]
[null,null,"nämlich ",null,null,"vom ",null,null,null,null,null,null,null,"bis ",null,null,null,null,null,null,null,null,null,{"$f":"IF(H11=\"\",\"\",H11-WEEKDAY(H11)+2-7)","v":""}]
[]
[null,null,"Grund",null,null,null,null,"Private Gründe:"]
[]
[null,null,null,null,null,null,null,"Militär, Zivilschutz:"]
[]
[null,null,null,null,null,null,null,"Weiterbildung:"]
[]
[null,null,null,null,null,null,null,"Expertentätigkeit:"]
[]
[null,null,null,null,null,null,null,"weitere:"]
[]
[]
[null,null,"Stellvertreter ja/nein?"]
[]
[null,null,null,null,null,null,null,"Name, Vorname"]
[]
[null,null,null,null,null,null,null,"Adresse mit PLZ"]
[]
[null,null,null,null,null,null,null,"Telefon"]
[]
[null,null,null,null,null,null,null,"Vorgesehenes Wochenpensum"]
[]
[null,null,"Bemerkungen"]
[]
[]
[]
[null,null,"Datum",null,null,null,null,null,null,null,null,null,null,"Unterschrift"]
[]
[]
[]
[null,null,"ENTSCHEID URLAUBSGESUCH"]
[]
[null,null,"Lehrperson",null,null,null,null,{"$f":"IF(H6=\"\",\"\",H6)","v":""},null,null,null,null,null,null,{"$f":"IF(O6=\"\",\"\",O6)","v":""}]
[]
[null,null,null,null,null,null,null,"Datum",null,null,"Std",null,null,null,"Datum",null,null,"Std"]
[null,null,"Urlaub",null,null,"vom ",null,{"$f":"IF(H11=\"\",\"\",H11)","v":""},null,null,{"$f":"IF(K11=\"\",\"\",K11)","v":""},null,null,"bis ",{"$f":"IF(O11=\"\",\"\",O11)","v":""},null,null,{"$f":"IF(R11=\"\",\"\",R11)","v":""}]
[]
[null,null,"Grund",null,null,null,null,{"$f":"IF(F13=\"\",\"\",F13)","v":""}]
[]
[null,null,"Entscheid",null,null,null,null,null,"bewilligt",null,null,null,null,null,null,"nicht bewilligt"]
[]
[null,null,null,null,null,null,null,null,"bezahlt",null,null,null,null,null,null,"unbezahlt",null,null,null,"Kompensation"]
[]
[null,null,"Bemerkungen"]
[]
[]
[]
[null,null,"Datum",null,null,null,null,null,null,null,null,null,null,"Unterschrift SL"]
[]
[]
[null,null,"Formular Urlaubsgesuch und Vertretungsplanung spätestens am Montag der Vorwoche"]
[null,null,"der ersten Absenz in das Fach des Sekretariats"]

{"sheet":"Vertretung","index":1,"n_rows":74,"n_cols":44,"rows_kept":74,"cut":false,"hidden":false,"merged":[[2,13,2,24],[70,6,70,7],[70,16,70,24],[9,6,9,24],[5,6,5,7],[5,13,5,14],[7,6,7,24]]}
["mail@kssursee.ch;stundenplaner@kssursee.ch",null,"Kantonsschule Sursee",null,null,null,null,null,null,null,null,null,null,null,null,null,null,null,null,null,null,null,null,null,"Vertretungsplanung",null,null,null,null,"Monat ",9,"Jahr",2019,null,null,null,{"$f":"11*WEEKDAY(G6)+J6-8","v":69},{"$f":"11*WEEKDAY(N6)+Q6-8","v":69}]
[null,null,null,null,null,null,"Kürzel",null,null,null,null,null,null,"Name, Vorname",null,null,null,null,null,null,null,null,null,null,null,null,null,null,null,null,null,null,null,null,null,null,{"$f":"WEEKDAY(DATE(AG1,AE1,1))","v":1},{"$f":"DATE(AG1,AE1+1,1)-DATE(AG1,AE1,1)","v":30}]
[null,null,"Lehrperson:",null,null,null,null,null,null,null,null,null,null,{"$f":"IF(ISERROR(VLOOKUP(G3,'GPU004'!A:B,2,FALSE)),\"\",VLOOKUP(G3,'GPU004'!A:B,2,FALSE))","v":""},null,null,null,null,null,null,null,null,null,null,null,null,null,null,null,"So","Mo","Di","Mi",null,null,"Do","Fr","Sa"]
[]
[null,null,null,null,null,null,"Datum",null,null,"Std",null,null,null,"Datum",null,null,"Std",null,null,null,null,null,"Abgabetermin",null,null,null,null,null,null,{"$f":"IF(2-AK$2<=0,\"\",2-AK$2)","v":1},{"$f":"IF(3-AK$2<=0,\"\",3-AK$2)","v":2},{"$f":"IF(4-AK$2<=0,\"\",4-AK$2)","v":3},{"$f":"IF(5-AK$2<=0,\"\",5-AK$2)","v":4},null,null,{"$f":"IF(6-AK$2<=0,\"\",6-AK$2)","v":5},{"$f":"IF(7-AK$2<=0,\"\",7-AK$2)","v":6},{"$f":"IF(8-AK$2<=0,\"\",8-AK$2)","v":7}]
[null,null,"ist abwesend",null,null,"vom ",null,null,null,null,null,null,"bis ",null,null,null,null,null,null,null,null,null,{"$f":"IF(G6=\"\",\"\",G6-WEEKDAY(G6)+2-7)","v":""},null,{"$f":"IF(W6<TODAY(),\"verspätet\",\"\")","v":""},null,null,null,null,{"$f":"AL5+1","v":8},{"$f":"AD6+1","v":9},{"$f":"AE6+1","v":10},{"$f":"AF6+1","v":11},null,null,{"$f":"AG6+1","v":12},{"$f":"AJ6+1","v":13},{"$f":"AK6+1","v":14}]
[null,null,null,null,null,null,null,null,null,null,null,null,null,null,null,null,null,null,null,null,null,null,null,null,null,null,null,null,null,{"$f":"AD6+7","v":15},16,17,18,null,null,{"$f":"AJ6+7","v":19},20,21]
[null,null,"Grund",null,null,null,null,null,null,null,null,null,null,null,null,null,null,null,null,null,null,null,null,null,null,null,null,null,null,22,23,24,25,null,null,26,27,28]
[null,null,null,null,null,null,null,null,null,null,null,null,null,null,null,null,null,null,null,null,null,null,null,null,null,null,null,null,null,{"$f":"IF(AD7+14>AL$2,\"\",AD7+14)","v":29},{"$f":"IF(AE7+14>AL$2,\"\",AE7+14)","v":30},{"$f":"IF(AF7+14>AL$2,\"\",AF7+14)","v":""},{"$f":"IF(AG7+14>AL$2,\"\",AG7+14)","v":""},null,null,{"$f":"IF(AJ7+14>AL$2,\"\",AJ7+14)","v":""},{"$f":"IF(AK7+14>AL$2,\"\",AK7+14)","v":""},{"$f":"IF(AL7+14>AL$2,\"\",AL7+14)","v":""}]
[null,null,"Bei Rückfragen Tel",null,null,null,null,null,null,null,null,null,null,null,null,null,null,null,null,null,null,null,null,null,null,null,null,null,null,{"$f":"IF(AD8+14>AL$2,\"\",AD8+14)","v":""},{"$f":"IF(AE8+14>AL$2,\"\",AE8+14)","v":""},{"$f":"IF(AF8+14>AL$2,\"\",AF8+14)","v":""},{"$f":"IF(AG8+14>AL$2,\"\",AG8+14)","v":""},null,null,{"$f":"IF(AJ8+14>AL$2,\"\",AJ8+14)","v":""},{"$f":"IF(AK8+14>AL$2,\"\",AK8+14)","v":""},{"$f":"IF(AL8+14>AL$2,\"\",AL8+14)","v":""}]
[]
[null,null,null,null,"Normalplan",null,null,null,null,"Entsch. Planer",null,null,"Ersatzplan",null,null,null,"Stillbesch.",null,"Aufs.",null,"Ausfall",null,"Bemerkung",null,"Ent. SL","korrekt",null,null,null,"Plan Klasse","1a",null,null,null,null,"Plan Lehrer","arn",null,null,null,null,"Plan Raum",10]
[null,null,"Datum","Tag","(Kl)","(Le)","(Fa)","(Zi)",null,"x",null,"Kl","Le","Fa","Zi",null,"x",null,"Le",null,"x"]
[]
[{"$f":"CONCATENATE(\"1/1/\",$G$3)","v":"1/1/"},{"$f":"(ISERROR(VLOOKUP($A15,'GPU001'!$A:$J,6,FALSE)))","v":true},{"$f":"IF(ISBLANK(G6),\"\",G6-WEEKDAY(G6)+2)","v":""},"Mo 1",{"$f":"IF($B15,\"\",VLOOKUP($A15,'GPU001'!$A:$J,5,FALSE))","v":""},{"$f":"IF($B15,\"\",VLOOKUP($A15,'GPU001'!$A:$J,6,FALSE))","v":""},{"$f":"IF($B15,\"\",VLOOKUP($A15,'GPU001'!$A:$J,7,FALSE))","v":""},{"$f":"IF($B15,\"\",VLOOKUP($A15,'GPU001'!$A:$J,8,FALSE))","v":""},null,null,null,null,null,null,null,null,null,null,null,null,null,null,null,null,null,{"$f":"IF(IF(E15=\"\",FALSE,AND(ROW()>=$AK$1,ROW()<=$AL$1)),IF(AND(AND(ISBLANK(J15),ISBLANK(S15),ISBLANK(U15),ISBLANK(Q15)),OR(ISBLANK(M15),ISBLANK(N15))),\"offen\",\"i.O.\"),\"\")","v":""},null,{"$f":"CONCATENATE(\"1/1/\",$AK$12)","v":"1/1/arn"},{"$f":"(ISERROR(VLOOKUP($AB15,'GPU001'!$A:$J,6,FALSE)))","v":true},{"$f":"IF($AI15,\"\",VLOOKUP($AH15,'GPU001'!$B:$J,5,FALSE))","v":"KOR"},{"$f":"IF($AI15,\"\",VLOOKUP($AH15,'GPU001'!$B:$J,6,FALSE))","v":"DE"},{"$f":"IF($AI15,\"\",VLOOKUP($AH15,'GPU001'!$B:$J,7,FALSE))","v":213},null,{"$f":"CONCATENATE(\"1/1/\",$AE$12)","v":"1/1/1a"},{"$f":"(ISERROR(VLOOKUP($AH15,'GPU001'!$B:$J,5,FALSE)))","v":false},{"$f":"IF($AC15,\"\",VLOOKUP($AB15,'GPU001'!$A:$J,5,FALSE))","v":""},{"$f":"IF($AC15,\"\",VLOOKUP($AB15,'GPU001'!$A:$J,7,FALSE))","v":""},{"$f":"IF($AC15,\"\",VLOOKUP($AB15,'GPU001'!$A:$J,8,FALSE))","v":""},null,{"$f":"CONCATENATE(\"1/1/\",$AQ$12)","v":"1/1/10"},{"$f":"(ISERROR(VLOOKUP($AN15,'GPU001'!$C:$J,4,FALSE)))","v":true},{"$f":"IF($AO15,\"\",VLOOKUP($AN15,'GPU001'!$C:$J,4,FALSE))","v":""},{"$f":"IF($AO15,\"\",VLOOKUP($AN15,'GPU001'!$C:$J,3,FALSE))","v":""},{"$f":"IF($AO15,\"\",VLOOKUP($AN15,'GPU001'!$C:$J,5,FALSE))","v":""}]
[{"$f":"CONCATENATE(\"1/2/\",$G$3)","v":"1/2/"},{"$f":"(ISERROR(VLOOKUP($A16,'GPU001'!$A:$J,6,FALSE)))","v":true},null,"Mo 2",{"$f":"IF($B16,\"\",VLOOKUP($A16,'GPU001'!$A:$J,5,FALSE))","v":""},{"$f":"IF($B16,\"\",VLOOKUP($A16,'GPU001'!$A:$J,6,FALSE))","v":""},{"$f":"IF($B16,\"\",VLOOKUP($A16,'GPU001'!$A:$J,7,FALSE))","v":""},{"$f":"IF($B16,\"\",VLOOKUP($A16,'GPU001'!$A:$J,8,FALSE))","v":""},null,null,null,null,null,null,null,null,null,null,null,null,null,null,null,null,null,{"$f":"IF(IF(E16=\"\",FALSE,AND(ROW()>=$AK$1,ROW()<=$AL$1)),IF(AND(AND(ISBLANK(J16),ISBLANK(S16),ISBLANK(U16),ISBLANK(Q16)),OR(ISBLANK(M16),ISBLANK(N16))),\"offen\",\"i.O.\"),\"\")","v":""},null,{"$f":"CONCATENATE(\"1/2/\",$AK$12)","v":"1/2/arn"},{"$f":"(ISERROR(VLOOKUP($AB16,'GPU001'!$A:$J,6,FALSE)))","v":true},{"$f":"IF($AI16,\"\",VLOOKUP($AH16,'GPU001'!$B:$J,5,FALSE))","v":"KOR"},{"$f":"IF($AI16,\"\",VLOOKUP($AH16,'GPU001'!$B:$J,6,FALSE))","v":"DE"},{"$f":"IF($AI16,\"\",VLOOKUP($AH16,'GPU001'!$B:$J,7,FALSE))","v":213},null,{"$f":"CONCATENATE(\"1/2/\",$AE$12)","v":"1/2/1a"},{"$f":"(ISERROR(VLOOKUP($AH16,'GPU001'!$B:$J,5,FALSE)))","v":false},{"$f":"IF($AC16,\"\",VLOOKUP($AB16,'GPU001'!$A:$J,5,FALSE))","v":""},{"$f":"IF($AC16,\"\",VLOOKUP($AB16,'GPU001'!$A:$J,7,FALSE))","v":""},{"$f":"IF($AC16,\"\",VLOOKUP($AB16,'GPU001'!$A:$J,8,FALSE))","v":""},null,{"$f":"CONCATENATE(\"1/2/\",$AQ$12)","v":"1/2/10"},{"$f":"(ISERROR(VLOOKUP($AN16,'GPU001'!$C:$J,4,FALSE)))","v":true},{"$f":"IF($AO16,\"\",VLOOKUP($AN16,'GPU001'!$C:$J,4,FALSE))","v":""},{"$f":"IF($AO16,\"\",VLOOKUP($AN16,'GPU001'!$C:$J,3,FALSE))","v":""},{"$f":"IF($AO16,\"\",VLOOKUP($AN16,'GPU001'!$C:$J,5,FALSE))","v":""}]
[{"$f":"CONCATENATE(\"1/3/\",$G$3)","v":"1/3/"},{"$f":"(ISERROR(VLOOKUP($A17,'GPU001'!$A:$J,6,FALSE)))","v":true},null,"Mo 3",{"$f":"IF($B17,\"\",VLOOKUP($A17,'GPU001'!$A:$J,5,FALSE))","v":""},{"$f":"IF($B17,\"\",VLOOKUP($A17,'GPU001'!$A:$J,6,FALSE))","v":""},{"$f":"IF($B17,\"\",VLOOKUP($A17,'GPU001'!$A:$J,7,FALSE))","v":""},{"$f":"IF($B17,\"\",VLOOKUP($A17,'GPU001'!$A:$J,8,FALSE))","v":""},null,null,null,null,null,null,null,null,null,null,null,null,null,null,null,null,null,"",null,{"$f":"CONCATENATE(\"1/3/\",$AK$12)","v":"1/3/arn"},{"$f":"(ISERROR(VLOOKUP($AB17,'GPU001'!$A:$J,6,FALSE)))","v":true},{"$f":"IF($AI17,\"\",VLOOKUP($AH17,'GPU001'!$B:$J,5,FALSE))","v":"GRM"},{"$f":"IF($AI17,\"\",VLOOKUP($AH17,'GPU001'!$B:$J,6,FALSE))","v":"SH"},{"$f":"IF($AI17,\"\",VLOOKUP($AH17,'GPU001'!$B:$J,7,FALSE))","v":"TS2"},null,{"$f":"CONCATENATE(\"1/3/\",$AE$12)","v":"1/3/1a"},{"$f":"(ISERROR(VLOOKUP($AH17,'GPU001'!$B:$J,5,FALSE)))","v":false},{"$f":"IF($AC17,\"\",VLOOKUP($AB17,'GPU001'!$A:$J,5,FALSE))","v":""},{"$f":"IF($AC17,\"\",VLOOKUP($AB17,'GPU001'!$A:$J,7,FALSE))","v":""},{"$f":"IF($AC17,\"\",VLOOKUP($AB17,'GPU001'!$A:$J,8,FALSE))","v":""},null,{"$f":"CONCATENATE(\"1/3/\",$AQ$12)","v":"1/3/10"},{"$f":"(ISERROR(VLOOKUP($AN17,'GPU001'!$C:$J,4,FALSE)))","v":true},{"$f":"IF($AO17,\"\",VLOOKUP($AN17,'GPU001'!$C:$J,4,FALSE))","v":""},{"$f":"IF($AO17,\"\",VLOOKUP($AN17,'GPU001'!$C:$J,3,FALSE))","v":""},{"$f":"IF($AO17,\"\",VLOOKUP($AN17,'GPU001'!$C:$J,5,FALSE))","v":""}]
[{"$f":"CONCATENATE(\"1/4/\",$G$3)","v":"1/4/"},{"$f":"(ISERROR(VLOOKUP($A18,'GPU001'!$A:$J,6,FALSE)))","v":true},null,"Mo 4",{"$f":"IF($B18,\"\",VLOOKUP($A18,'GPU001'!$A:$J,5,FALSE))","v":""},{"$f":"IF($B18,\"\",VLOOKUP($A18,'GPU001'!$A:$J,6,FALSE))","v":""},{"$f":"IF($B18,\"\",VLOOKUP($A18,'GPU001'!$A:$J,7,FALSE))","v":""},{"$f":"IF($B18,\"\",VLOOKUP($A18,'GPU001'!$A:$J,8,FALSE))","v":""},null,null,null,null,null,null,null,null,null,null,null,null,null,null,null,null,null,"",null,{"$f":"CONCATENATE(\"1/4/\",$AK$12)","v":"1/4/arn"},{"$f":"(ISERROR(VLOOKUP($AB18,'GPU001'!$A:$J,6,FALSE)))","v":true},{"$f":"IF($AI18,\"\",VLOOKUP($AH18,'GPU001'!$B:$J,5,FALSE))","v":"GRM"},{"$f":"IF($AI18,\"\",VLOOKUP($AH18,'GPU001'!$B:$J,6,FALSE))","v":"SH"},{"$f":"IF($AI18,\"\",VLOOKUP($AH18,'GPU001'!$B:$J,7,FALSE))","v":"TS2"},null,{"$f":"CONCATENATE(\"1/4/\",$AE$12)","v":"1/4/1a"},{"$f":"(ISERROR(VLOOKUP($AH18,'GPU001'!$B:$J,5,FALSE)))","v":false},{"$f":"IF($AC18,\"\",VLOOKUP($AB18,'GPU001'!$A:$J,5,FALSE))","v":""},{"$f":"IF($AC18,\"\",VLOOKUP($AB18,'GPU001'!$A:$J,7,FALSE))","v":""},{"$f":"IF($AC18,\"\",VLOOKUP($AB18,'GPU001'!$A:$J,8,FALSE))","v":""},null,{"$f":"CONCATENATE(\"1/4/\",$AQ$12)","v":"1/4/10"},{"$f":"(ISERROR(VLOOKUP($AN18,'GPU001'!$C:$J,4,FALSE)))","v":true},{"$f":"IF($AO18,\"\",VLOOKUP($AN18,'GPU001'!$C:$J,4,FALSE))","v":""},{"$f":"IF($AO18,\"\",VLOOKUP($AN18,'GPU001'!$C:$J,3,FALSE))","v":""},{"$f":"IF($AO18,\"\",VLOOKUP($AN18,'GPU001'!$C:$J,5,FALSE))","v":""}]
[{"$f":"CONCATENATE(\"1/5/\",$G$3)","v":"1/5/"},{"$f":"(ISERROR(VLOOKUP($A19,'GPU001'!$A:$J,6,FALSE)))","v":true},null,"Mo 5",{"$f":"IF($B19,\"\",VLOOKUP($A19,'GPU001'!$A:$J,5,FALSE))","v":""},{"$f":"IF($B19,\"\",VLOOKUP($A19,'GPU001'!$A:$J,6,FALSE))","v":""},{"$f":"IF($B19,\"\",VLOOKUP($A19,'GPU001'!$A:$J,7,FALSE))","v":""},{"$f":"IF($B19,\"\",VLOOKUP($A19,'GPU001'!$A:$J,8,FALSE))","v":""},null,null,null,null,null,null,null,null,null,null,null,null,null,null,null,null,null,"",null,{"$f":"CONCATENATE(\"1/5/\",$AK$12)","v":"1/5/arn"},{"$f":"(ISERROR(VLOOKUP($AB19,'GPU001'!$A:$J,6,FALSE)))","v":true},{"$f":"IF($AI19,\"\",VLOOKUP($AH19,'GPU001'!$B:$J,5,FALSE))","v":""},{"$f":"IF($AI19,\"\",VLOOKUP($AH19,'GPU001'!$B:$J,6,FALSE))","v":""},{"$f":"IF($AI19,\"\",VLOOKUP($AH19,'GPU001'!$B:$J,7,FALSE))","v":""},null,{"$f":"CONCATENATE(\"1/5/\",$AE$12)","v":"1/5/1a"},{"$f":"(ISERROR(VLOOKUP($AH19,'GPU001'!$B:$J,5,FALSE)))","v":true},{"$f":"IF($AC19,\"\",VLOOKUP($AB19,'GPU001'!$A:$J,5,FALSE))","v":""},{"$f":"IF($AC19,\"\",VLOOKUP($AB19,'GPU001'!$A:$J,7,FALSE))","v":""},{"$f":"IF($AC19,\"\",VLOOKUP($AB19,'GPU001'!$A:$J,8,FALSE))","v":""},null,{"$f":"CONCATENATE(\"1/5/\",$AQ$12)","v":"1/5/10"},{"$f":"(ISERROR(VLOOKUP($AN19,'GPU001'!$C:$J,4,FALSE)))","v":true},{"$f":"IF($AO19,\"\",VLOOKUP($AN19,'GPU001'!$C:$J,4,FALSE))","v":""},{"$f":"IF($AO19,\"\",VLOOKUP($AN19,'GPU001'!$C:$J,3,FALSE))","v":""},{"$f":"IF($AO19,\"\",VLOOKUP($AN19,'GPU001'!$C:$J,5,FALSE))","v":""}]
[{"$f":"CONCATENATE(\"1/6/\",$G$3)","v":"1/6/"},{"$f":"(ISERROR(VLOOKUP($A20,'GPU001'!$A:$J,6,FALSE)))","v":true},null,"Mo 6",{"$f":"IF($B20,\"\",VLOOKUP($A20,'GPU001'!$A:$J,5,FALSE))","v":""},{"$f":"IF($B20,\"\",VLOOKUP($A20,'GPU001'!$A:$J,6,FALSE))","v":""},{"$f":"IF($B20,\"\",VLOOKUP($A20,'GPU001'!$A:$J,7,FALSE))","v":""},{"$f":"IF($B20,\"\",VLOOKUP($A20,'GPU001'!$A:$J,8,FALSE))","v":""},null,null,null,null,null,null,null,null,null,null,null,null,null,null,null,null,null,"",null,{"$f":"CONCATENATE(\"1/6/\",$AK$12)","v":"1/6/arn"},{"$f":"(ISERROR(VLOOKUP($AB20,'GPU001'!$A:$J,6,FALSE)))","v":true},{"$f":"IF($AI20,\"\",VLOOKUP($AH20,'GPU001'!$B:$J,5,FALSE))","v":""},{"$f":"IF($AI20,\"\",VLOOKUP($AH20,'GPU001'!$B:$J,6,FALSE))","v":""},{"$f":"IF($AI20,\"\",VLOOKUP($AH20,'GPU001'!$B:$J,7,FALSE))","v":""},null,{"$f":"CONCATENATE(\"1/6/\",$AE$12)","v":"1/6/1a"},{"$f":"(ISERROR(VLOOKUP($AH20,'GPU001'!$B:$J,5,FALSE)))","v":true},{"$f":"IF($AC20,\"\",VLOOKUP($AB20,'GPU001'!$A:$J,5,FALSE))","v":""},{"$f":"IF($AC20,\"\",VLOOKUP($AB20,'GPU001'!$A:$J,7,FALSE))","v":""},{"$f":"IF($AC20,\"\",VLOOKUP($AB20,'GPU001'!$A:$J,8,FALSE))","v":""},null,{"$f":"CONCATENATE(\"1/6/\",$AQ$12)","v":"1/6/10"},{"$f":"(ISERROR(VLOOKUP($AN20,'GPU001'!$C:$J,4,FALSE)))","v":true},{"$f":"IF($AO20,\"\",VLOOKUP($AN20,'GPU001'!$C:$J,4,FALSE))","v":""},{"$f":"IF($AO20,\"\",VLOOKUP($AN20,'GPU001'!$C:$J,3,FALSE))","v":""},{"$f":"IF($AO20,\"\",VLOOKUP($AN20,'GPU001'!$C:$J,5,FALSE))","v":""}]
[{"$f":"CONCATENATE(\"1/7/\",$G$3)","v":"1/7/"},{"$f":"(ISERROR(VLOOKUP($A21,'GPU001'!$A:$J,6,FALSE)))","v":true},null,"Mo 7",{"$f":"IF($B21,\"\",VLOOKUP($A21,'GPU001'!$A:$J,5,FALSE))","v":""},{"$f":"IF($B21,\"\",VLOOKUP($A21,'GPU001'!$A:$J,6,FALSE))","v":""},{"$f":"IF($B21,\"\",VLOOKUP($A21,'GPU001'!$A:$J,7,FALSE))","v":""},{"$f":"IF($B21,\"\",VLOOKUP($A21,'GPU001'!$A:$J,8,FALSE))","v":""},null,null,null,null,null,null,null,null,null,null,null,null,null,null,null,null,null,"",null,{"$f":"CONCATENATE(\"1/7/\",$AK$12)","v":"1/7/arn"},{"$f":"(ISERROR(VLOOKUP($AB21,'GPU001'!$A:$J,6,FALSE)))","v":true},{"$f":"IF($AI21,\"\",VLOOKUP($AH21,'GPU001'!$B:$J,5,FALSE))","v":"BUR"},{"$f":"IF($AI21,\"\",VLOOKUP($AH21,'GPU001'!$B:$J,6,FALSE))","v":"EN"},{"$f":"IF($AI21,\"\",VLOOKUP($AH21,'GPU001'!$B:$J,7,FALSE))","v":17},null,{"$f":"CONCATENATE(\"1/7/\",$AE$12)","v":"1/7/1a"},{"$f":"(ISERROR(VLOOKUP($AH21,'GPU001'!$B:$J,5,FALSE)))","v":false},{"$f":"IF($AC21,\"\",VLOOKUP($AB21,'GPU001'!$A:$J,5,FALSE))","v":""},{"$f":"IF($AC21,\"\",VLOOKUP($AB21,'GPU001'!$A:$J,7,FALSE))","v":""},{"$f":"IF($AC21,\"\",VLOOKUP($AB21,'GPU001'!$A:$J,8,FALSE))","v":""},null,{"$f":"CONCATENATE(\"1/7/\",$AQ$12)","v":"1/7/10"},{"$f":"(ISERROR(VLOOKUP($AN21,'GPU001'!$C:$J,4,FALSE)))","v":false},{"$f":"IF($AO21,\"\",VLOOKUP($AN21,'GPU001'!$C:$J,4,FALSE))","v":"GUT"},{"$f":"IF($AO21,\"\",VLOOKUP($AN21,'GPU001'!$C:$J,3,FALSE))","v":"F1A"},{"$f":"IF($AO21,\"\",VLOOKUP($AN21,'GPU001'!$C:$J,5,FALSE))","v":"MI"}]
[{"$f":"CONCATENATE(\"1/8/\",$G$3)","v":"1/8/"},{"$f":"(ISERROR(VLOOKUP($A22,'GPU001'!$A:$J,6,FALSE)))","v":true},null,"Mo 8",{"$f":"IF($B22,\"\",VLOOKUP($A22,'GPU001'!$A:$J,5,FALSE))","v":""},{"$f":"IF($B22,\"\",VLOOKUP($A22,'GPU001'!$A:$J,6,FALSE))","v":""},{"$f":"IF($B22,\"\",VLOOKUP($A22,'GPU001'!$A:$J,7,FALSE))","v":""},{"$f":"IF($B22,\"\",VLOOKUP($A22,'GPU001'!$A:$J,8,FALSE))","v":""},null,null,null,null,null,null,null,null,null,null,null,null,null,null,null,null,null,"",null,{"$f":"CONCATENATE(\"1/8/\",$AK$12)","v":"1/8/arn"},{"$f":"(ISERROR(VLOOKUP($AB22,'GPU001'!$A:$J,6,FALSE)))","v":true},{"$f":"IF($AI22,\"\",VLOOKUP($AH22,'GPU001'!$B:$J,5,FALSE))","v":"BUR"},{"$f":"IF($AI22,\"\",VLOOKUP($AH22,'GPU001'!$B:$J,6,FALSE))","v":"EN"},{"$f":"IF($AI22,\"\",VLOOKUP($AH22,'GPU001'!$B:$J,7,FALSE))","v":17},null,{"$f":"CONCATENATE(\"1/8/\",$AE$12)","v":"1/8/1a"},{"$f":"(ISERROR(VLOOKUP($AH22,'GPU001'!$B:$J,5,FALSE)))","v":false},{"$f":"IF($AC22,\"\",VLOOKUP($AB22,'GPU001'!$A:$J,5,FALSE))","v":""},{"$f":"IF($AC22,\"\",VLOOKUP($AB22,'GPU001'!$A:$J,7,FALSE))","v":""},{"$f":"IF($AC22,\"\",VLOOKUP($AB22,'GPU001'!$A:$J,8,FALSE))","v":""},null,{"$f":"CONCATENATE(\"1/8/\",$AQ$12)","v":"1/8/10"},{"$f":"(ISERROR(VLOOKUP($AN22,'GPU001'!$C:$J,4,FALSE)))","v":false},{"$f":"IF($AO22,\"\",VLOOKUP($AN22,'GPU001'!$C:$J,4,FALSE))","v":"GUT"},{"$f":"IF($AO22,\"\",VLOOKUP($AN22,'GPU001'!$C:$J,3,FALSE))","v":"F1A"},{"$f":"IF($AO22,\"\",VLOOKUP($AN22,'GPU001'!$C:$J,5,FALSE))","v":"MI"}]
[{"$f":"CONCATENATE(\"1/9/\",$G$3)","v":"1/9/"},{"$f":"(ISERROR(VLOOKUP($A23,'GPU001'!$A:$J,6,FALSE)))","v":true},null,"Mo 9",{"$f":"IF($B23,\"\",VLOOKUP($A23,'GPU001'!$A:$J,5,FALSE))","v":""},{"$f":"IF($B23,\"\",VLOOKUP($A23,'GPU001'!$A:$J,6,FALSE))","v":""},{"$f":"IF($B23,\"\",VLOOKUP($A23,'GPU001'!$A:$J,7,FALSE))","v":""},{"$f":"IF($B23,\"\",VLOOKUP($A23,'GPU001'!$A:$J,8,FALSE))","v":""},null,null,null,null,null,null,null,null,null,null,null,null,null,null,null,null,null,"",null,{"$f":"CONCATENATE(\"1/9/\",$AK$12)","v":"1/9/arn"},{"$f":"(ISERROR(VLOOKUP($AB23,'GPU001'!$A:$J,6,FALSE)))","v":true},{"$f":"IF($AI23,\"\",VLOOKUP($AH23,'GPU001'!$B:$J,5,FALSE))","v":"CON"},{"$f":"IF($AI23,\"\",VLOOKUP($AH23,'GPU001'!$B:$J,6,FALSE))","v":"MA"},{"$f":"IF($AI23,\"\",VLOOKUP($AH23,'GPU001'!$B:$J,7,FALSE))","v":112},null,{"$f":"CONCATENATE(\"1/9/\",$AE$12)","v":"1/9/1a"},{"$f":"(ISERROR(VLOOKUP($AH23,'GPU001'!$B:$J,5,FALSE)))","v":false},{"$f":"IF($AC23,\"\",VLOOKUP($AB23,'GPU001'!$A:$J,5,FALSE))","v":""},{"$f":"IF($AC23,\"\",VLOOKUP($AB23,'GPU001'!$A:$J,7,FALSE))","v":""},{"$f":"IF($AC23,\"\",VLOOKUP($AB23,'GPU001'!$A:$J,8,FALSE))","v":""},null,{"$f":"CONCATENATE(\"1/9/\",$AQ$12)","v":"1/9/10"},{"$f":"(ISERROR(VLOOKUP($AN23,'GPU001'!$C:$J,4,FALSE)))","v":false},{"$f":"IF($AO23,\"\",VLOOKUP($AN23,'GPU001'!$C:$J,4,FALSE))","v":"GUT"},{"$f":"IF($AO23,\"\",VLOOKUP($AN23,'GPU001'!$C:$J,3,FALSE))","v":"F2A"},{"$f":"IF($AO23,\"\",VLOOKUP($AN23,'GPU001'!$C:$J,5,FALSE))","v":"MI"}]
[{"$f":"CONCATENATE(\"1/10/\",$G$3)","v":"1/10/"},{"$f":"(ISERROR(VLOOKUP($A24,'GPU001'!$A:$J,6,FALSE)))","v":true},null,"Mo 10",{"$f":"IF($B24,\"\",VLOOKUP($A24,'GPU001'!$A:$J,5,FALSE))","v":""},{"$f":"IF($B24,\"\",VLOOKUP($A24,'GPU001'!$A:$J,6,FALSE))","v":""},{"$f":"IF($B24,\"\",VLOOKUP($A24,'GPU001'!$A:$J,7,FALSE))","v":""},{"$f":"IF($B24,\"\",VLOOKUP($A24,'GPU001'!$A:$J,8,FALSE))","v":""},null,null,null,null,null,null,null,null,null,null,null,null,null,null,null,null,null,"",null,{"$f":"CONCATENATE(\"1/10/\",$AK$12)","v":"1/10/arn"},{"$f":"(ISERROR(VLOOKUP($AB24,'GPU001'!$A:$J,6,FALSE)))","v":true},{"$f":"IF($AI24,\"\",VLOOKUP($AH24,'GPU001'!$B:$J,5,FALSE))","v":"CON"},{"$f":"IF($AI24,\"\",VLOOKUP($AH24,'GPU001'!$B:$J,6,FALSE))","v":"MA"},{"$f":"IF($AI24,\"\",VLOOKUP($AH24,'GPU001'!$B:$J,7,FALSE))","v":112},null,{"$f":"CONCATENATE(\"1/10/\",$AE$12)","v":"1/10/1a"},{"$f":"(ISERROR(VLOOKUP($AH24,'GPU001'!$B:$J,5,FALSE)))","v":false},{"$f":"IF($AC24,\"\",VLOOKUP($AB24,'GPU001'!$A:$J,5,FALSE))","v":""},{"$f":"IF($AC24,\"\",VLOOKUP($AB24,'GPU001'!$A:$J,7,FALSE))","v":""},{"$f":"IF($AC24,\"\",VLOOKUP($AB24,'GPU001'!$A:$J,8,FALSE))","v":""},null,{"$f":"CONCATENATE(\"1/10/\",$AQ$12)","v":"1/10/10"},{"$f":"(ISERROR(VLOOKUP($AN24,'GPU001'!$C:$J,4,FALSE)))","v":false},{"$f":"IF($AO24,\"\",VLOOKUP($AN24,'GPU001'!$C:$J,4,FALSE))","v":"GUT"},{"$f":"IF($AO24,\"\",VLOOKUP($AN24,'GPU001'!$C:$J,3,FALSE))","v":"F2A"},{"$f":"IF($AO24,\"\",VLOOKUP($AN24,'GPU001'!$C:$J,5,FALSE))","v":"MI"}]
[{"$f":"CONCATENATE(\"1/11/\",$G$3)","v":"1/11/"},{"$f":"(ISERROR(VLOOKUP($A25,'GPU001'!$A:$J,6,FALSE)))","v":true},null,"Mo 11",{"$f":"IF($B25,\"\",VLOOKUP($A25,'GPU001'!$A:$J,5,FALSE))","v":""},{"$f":"IF($B25,\"\",VLOOKUP($A25,'GPU001'!$A:$J,6,FALSE))","v":""},{"$f":"IF($B25,\"\",VLOOKUP($A25,'GPU001'!$A:$J,7,FALSE))","v":""},{"$f":"IF($B25,\"\",VLOOKUP($A25,'GPU001'!$A:$J,8,FALSE))","v":""},null,null,null,null,null,null,null,null,null,null,null,null,null,null,null,null,null,"",null,{"$f":"CONCATENATE(\"1/11/\",$AK$12)","v":"1/11/arn"},{"$f":"(ISERROR(VLOOKUP($AB25,'GPU001'!$A:$J,6,FALSE)))","v":true},{"$f":"IF($AI25,\"\",VLOOKUP($AH25,'GPU001'!$B:$J,5,FALSE))","v":""},{"$f":"IF($AI25,\"\",VLOOKUP($AH25,'GPU001'!$B:$J,6,FALSE))","v":""},{"$f":"IF($AI25,\"\",VLOOKUP($AH25,'GPU001'!$B:$J,7,FALSE))","v":""},null,{"$f":"CONCATENATE(\"1/11/\",$AE$12)","v":"1/11/1a"},{"$f":"(ISERROR(VLOOKUP($AH25,'GPU001'!$B:$J,5,FALSE)))","v":true},{"$f":"IF($AC25,\"\",VLOOKUP($AB25,'GPU001'!$A:$J,5,FALSE))","v":""},{"$f":"IF($AC25,\"\",VLOOKUP($AB25,'GPU001'!$A:$J,7,FALSE))","v":""},{"$f":"IF($AC25,\"\",VLOOKUP($AB25,'GPU001'!$A:$J,8,FALSE))","v":""},null,{"$f":"CONCATENATE(\"1/11/\",$AQ$12)","v":"1/11/10"},{"$f":"(ISERROR(VLOOKUP($AN25,'GPU001'!$C:$J,4,FALSE)))","v":true},{"$f":"IF($AO25,\"\",VLOOKUP($AN25,'GPU001'!$C:$J,4,FALSE))","v":""},{"$f":"IF($AO25,\"\",VLOOKUP($AN25,'GPU001'!$C:$J,3,FALSE))","v":""},{"$f":"IF($AO25,\"\",VLOOKUP($AN25,'GPU001'!$C:$J,5,FALSE))","v":""}]
[{"$f":"CONCATENATE(\"2/1/\",$G$3)","v":"2/1/"},{"$f":"(ISERROR(VLOOKUP($A26,'GPU001'!$A:$J,6,FALSE)))","v":true},{"$f":"IF(ISTEXT(C15),\"\",C15+1)","v":""},"Di 1",{"$f":"IF($B26,\"\",VLOOKUP($A26,'GPU001'!$A:$J,5,FALSE))","v":""},{"$f":"IF($B26,\"\",VLOOKUP($A26,'GPU001'!$A:$J,6,FALSE))","v":""},{"$f":"IF($B26,\"\",VLOOKUP($A26,'GPU001'!$A:$J,7,FALSE))","v":""},{"$f":"IF($B26,\"\",VLOOKUP($A26,'GPU001'!$A:$J,8,FALSE))","v":""},null,null,null,null,null,null,null,null,null,null,null,null,null,null,null,null,null,"",null,{"$f":"CONCATENATE(\"2/1/\",$AK$12)","v":"2/1/arn"},{"$f":"(ISERROR(VLOOKUP($AB26,'GPU001'!$A:$J,6,FALSE)))","v":true},{"$f":"IF($AI26,\"\",VLOOKUP($AH26,'GPU001'!$B:$J,5,FALSE))","v":"BRO"},{"$f":"IF($AI26,\"\",VLOOKUP($AH26,'GPU001'!$B:$J,6,FALSE))","v":"TG"},{"$f":"IF($AI26,\"\",VLOOKUP($AH26,'GPU001'!$B:$J,7,FALSE))","v":"U42"},null,{"$f":"CONCATENATE(\"2/1/\",$AE$12)","v":"2/1/1a"},{"$f":"(ISERROR(VLOOKUP($AH26,'GPU001'!$B:$J,5,FALSE)))","v":false},{"$f":"IF($AC26,\"\",VLOOKUP($AB26,'GPU001'!$A:$J,5,FALSE))","v":""},{"$f":"IF($AC26,\"\",VLOOKUP($AB26,'GPU001'!$A:$J,7,FALSE))","v":""},{"$f":"IF($AC26,\"\",VLOOKUP($AB26,'GPU001'!$A:$J,8,FALSE))","v":""},null,{"$f":"CONCATENATE(\"2/1/\",$AQ$12)","v":"2/1/10"},{"$f":"(ISERROR(VLOOKUP($AN26,'GPU001'!$C:$J,4,FALSE)))","v":true},{"$f":"IF($AO26,\"\",VLOOKUP($AN26,'GPU001'!$C:$J,4,FALSE))","v":""},{"$f":"IF($AO26,\"\",VLOOKUP($AN26,'GPU001'!$C:$J,3,FALSE))","v":""},{"$f":"IF($AO26,\"\",VLOOKUP($AN26,'GPU001'!$C:$J,5,FALSE))","v":""}]
[{"$f":"CONCATENATE(\"2/2/\",$G$3)","v":"2/2/"},{"$f":"(ISERROR(VLOOKUP($A27,'GPU001'!$A:$J,6,FALSE)))","v":true},null,"Di 2",{"$f":"IF($B27,\"\",VLOOKUP($A27,'GPU001'!$A:$J,5,FALSE))","v":""},{"$f":"IF($B27,\"\",VLOOKUP($A27,'GPU001'!$A:$J,6,FALSE))","v":""},{"$f":"IF($B27,\"\",VLOOKUP($A27,'GPU001'!$A:$J,7,FALSE))","v":""},{"$f":"IF($B27,\"\",VLOOKUP($A27,'GPU001'!$A:$J,8,FALSE))","v":""},null,null,null,null,null,null,null,null,null,null,null,null,null,null,null,null,null,"",null,{"$f":"CONCATENATE(\"2/2/\",$AK$12)","v":"2/2/arn"},{"$f":"(ISERROR(VLOOKUP($AB27,'GPU001'!$A:$J,6,FALSE)))","v":true},{"$f":"IF($AI27,\"\",VLOOKUP($AH27,'GPU001'!$B:$J,5,FALSE))","v":"BRO"},{"$f":"IF($AI27,\"\",VLOOKUP($AH27,'GPU001'!$B:$J,6,FALSE))","v":"TG"},{"$f":"IF($AI27,\"\",VLOOKUP($AH27,'GPU001'!$B:$J,7,FALSE))","v":"U42"},null,{"$f":"CONCATENATE(\"2/2/\",$AE$12)","v":"2/2/1a"},{"$f":"(ISERROR(VLOOKUP($AH27,'GPU001'!$B:$J,5,FALSE)))","v":false},{"$f":"IF($AC27,\"\",VLOOKUP($AB27,'GPU001'!$A:$J,5,FALSE))","v":""},{"$f":"IF($AC27,\"\",VLOOKUP($AB27,'GPU001'!$A:$J,7,FALSE))","v":""},{"$f":"IF($AC27,\"\",VLOOKUP($AB27,'GPU001'!$A:$J,8,FALSE))","v":""},null,{"$f":"CONCATENATE(\"2/2/\",$AQ$12)","v":"2/2/10"},{"$f":"(ISERROR(VLOOKUP($AN27,'GPU001'!$C:$J,4,FALSE)))","v":true},{"$f":"IF($AO27,\"\",VLOOKUP($AN27,'GPU001'!$C:$J,4,FALSE))","v":""},{"$f":"IF($AO27,\"\",VLOOKUP($AN27,'GPU001'!$C:$J,3,FALSE))","v":""},{"$f":"IF($AO27,\"\",VLOOKUP($AN27,'GPU001'!$C:$J,5,FALSE))","v":""}]
[{"$f":"CONCATENATE(\"2/3/\",$G$3)","v":"2/3/"},{"$f":"(ISERROR(VLOOKUP($A28,'GPU001'!$A:$J,6,FALSE)))","v":true},null,"Di 3",{"$f":"IF($B28,\"\",VLOOKUP($A28,'GPU001'!$A:$J,5,FALSE))","v":""},{"$f":"IF($B28,\"\",VLOOKUP($A28,'GPU001'!$A:$J,6,FALSE))","v":""},{"$f":"IF($B28,\"\",VLOOKUP($A28,'GPU001'!$A:$J,7,FALSE))","v":""},{"$f":"IF($B28,\"\",VLOOKUP($A28,'GPU001'!$A:$J,8,FALSE))","v":""},null,null,null,null,null,null,null,null,null,null,null,null,null,null,null,null,null,"",null,{"$f":"CONCATENATE(\"2/3/\",$AK$12)","v":"2/3/arn"},{"$f":"(ISERROR(VLOOKUP($AB28,'GPU001'!$A:$J,6,FALSE)))","v":false},{"$f":"IF($AI28,\"\",VLOOKUP($AH28,'GPU001'!$B:$J,5,FALSE))","v":"GRB"},{"$f":"IF($AI28,\"\",VLOOKUP($AH28,'GPU001'!$B:$J,6,FALSE))","v":"FR"},{"$f":"IF($AI28,\"\",VLOOKUP($AH28,'GPU001'!$B:$J,7,FALSE))","v":14},null,{"$f":"CONCATENATE(\"2/3/\",$AE$12)","v":"2/3/1a"},{"$f":"(ISERROR(VLOOKUP($AH28,'GPU001'!$B:$J,5,FALSE)))","v":false},{"$f":"IF($AC28,\"\",VLOOKUP($AB28,'GPU001'!$A:$J,5,FALSE))","v":"4C"},{"$f":"IF($AC28,\"\",VLOOKUP($AB28,'GPU001'!$A:$J,7,FALSE))","v":"DE"},{"$f":"IF($AC28,\"\",VLOOKUP($AB28,'GPU001'!$A:$J,8,FALSE))","v":213},null,{"$f":"CONCATENATE(\"2/3/\",$AQ$12)","v":"2/3/10"},{"$f":"(ISERROR(VLOOKUP($AN28,'GPU001'!$C:$J,4,FALSE)))","v":false},{"$f":"IF($AO28,\"\",VLOOKUP($AN28,'GPU001'!$C:$J,4,FALSE))","v":"GHE"},{"$f":"IF($AO28,\"\",VLOOKUP($AN28,'GPU001'!$C:$J,3,FALSE))","v":"2E"},{"$f":"IF($AO28,\"\",VLOOKUP($AN28,'GPU001'!$C:$J,5,FALSE))","v":"IN"}]
[{"$f":"CONCATENATE(\"2/4/\",$G$3)","v":"2/4/"},{"$f":"(ISERROR(VLOOKUP($A29,'GPU001'!$A:$J,6,FALSE)))","v":true},null,"Di 4",{"$f":"IF($B29,\"\",VLOOKUP($A29,'GPU001'!$A:$J,5,FALSE))","v":""},{"$f":"IF($B29,\"\",VLOOKUP($A29,'GPU001'!$A:$J,6,FALSE))","v":""},{"$f":"IF($B29,\"\",VLOOKUP($A29,'GPU001'!$A:$J,7,FALSE))","v":""},{"$f":"IF($B29,\"\",VLOOKUP($A29,'GPU001'!$A:$J,8,FALSE))","v":""},null,null,null,null,null,null,null,null,null,null,null,null,null,null,null,null,null,"",null,{"$f":"CONCATENATE(\"2/4/\",$AK$12)","v":"2/4/arn"},{"$f":"(ISERROR(VLOOKUP($AB29,'GPU001'!$A:$J,6,FALSE)))","v":false},{"$f":"IF($AI29,\"\",VLOOKUP($AH29,'GPU001'!$B:$J,5,FALSE))","v":"GRB"},{"$f":"IF($AI29,\"\",VLOOKUP($AH29,'GPU001'!$B:$J,6,FALSE))","v":"FR"},{"$f":"IF($AI29,\"\",VLOOKUP($AH29,'GPU001'!$B:$J,7,FALSE))","v":14},null,{"$f":"CONCATENATE(\"2/4/\",$AE$12)","v":"2/4/1a"},{"$f":"(ISERROR(VLOOKUP($AH29,'GPU001'!$B:$J,5,FALSE)))","v":false},{"$f":"IF($AC29,\"\",VLOOKUP($AB29,'GPU001'!$A:$J,5,FALSE))","v":"4C"},{"$f":"IF($AC29,\"\",VLOOKUP($AB29,'GPU001'!$A:$J,7,FALSE))","v":"DE"},{"$f":"IF($AC29,\"\",VLOOKUP($AB29,'GPU001'!$A:$J,8,FALSE))","v":213},null,{"$f":"CONCATENATE(\"2/4/\",$AQ$12)","v":"2/4/10"},{"$f":"(ISERROR(VLOOKUP($AN29,'GPU001'!$C:$J,4,FALSE)))","v":false},{"$f":"IF($AO29,\"\",VLOOKUP($AN29,'GPU001'!$C:$J,4,FALSE))","v":"GHE"},{"$f":"IF($AO29,\"\",VLOOKUP($AN29,'GPU001'!$C:$J,3,FALSE))","v":"2E"},{"$f":"IF($AO29,\"\",VLOOKUP($AN29,'GPU001'!$C:$J,5,FALSE))","v":"IN"}]
[{"$f":"CONCATENATE(\"2/5/\",$G$3)","v":"2/5/"},{"$f":"(ISERROR(VLOOKUP($A30,'GPU001'!$A:$J,6,FALSE)))","v":true},null,"Di 5",{"$f":"IF($B30,\"\",VLOOKUP($A30,'GPU001'!$A:$J,5,FALSE))","v":""},{"$f":"IF($B30,\"\",VLOOKUP($A30,'GPU001'!$A:$J,6,FALSE))","v":""},{"$f":"IF($B30,\"\",VLOOKUP($A30,'GPU001'!$A:$J,7,FALSE))","v":""},{"$f":"IF($B30,\"\",VLOOKUP($A30,'GPU001'!$A:$J,8,FALSE))","v":""},null,null,null,null,null,null,null,null,null,null,null,null,null,null,null,null,null,"",null,{"$f":"CONCATENATE(\"2/5/\",$AK$12)","v":"2/5/arn"},{"$f":"(ISERROR(VLOOKUP($AB30,'GPU001'!$A:$J,6,FALSE)))","v":true},{"$f":"IF($AI30,\"\",VLOOKUP($AH30,'GPU001'!$B:$J,5,FALSE))","v":""},{"$f":"IF($AI30,\"\",VLOOKUP($AH30,'GPU001'!$B:$J,6,FALSE))","v":""},{"$f":"IF($AI30,\"\",VLOOKUP($AH30,'GPU001'!$B:$J,7,FALSE))","v":""},null,{"$f":"CONCATENATE(\"2/5/\",$AE$12)","v":"2/5/1a"},{"$f":"(ISERROR(VLOOKUP($AH30,'GPU001'!$B:$J,5,FALSE)))","v":true},{"$f":"IF($AC30,\"\",VLOOKUP($AB30,'GPU001'!$A:$J,5,FALSE))","v":""},{"$f":"IF($AC30,\"\",VLOOKUP($AB30,'GPU001'!$A:$J,7,FALSE))","v":""},{"$f":"IF($AC30,\"\",VLOOKUP($AB30,'GPU001'!$A:$J,8,FALSE))","v":""},null,{"$f":"CONCATENATE(\"2/5/\",$AQ$12)","v":"2/5/10"},{"$f":"(ISERROR(VLOOKUP($AN30,'GPU001'!$C:$J,4,FALSE)))","v":true},{"$f":"IF($AO30,\"\",VLOOKUP($AN30,'GPU001'!$C:$J,4,FALSE))","v":""},{"$f":"IF($AO30,\"\",VLOOKUP($AN30,'GPU001'!$C:$J,3,FALSE))","v":""},{"$f":"IF($AO30,\"\",VLOOKUP($AN30,'GPU001'!$C:$J,5,FALSE))","v":""}]
[{"$f":"CONCATENATE(\"2/6/\",$G$3)","v":"2/6/"},{"$f":"(ISERROR(VLOOKUP($A31,'GPU001'!$A:$J,6,FALSE)))","v":true},null,"Di 6",{"$f":"IF($B31,\"\",VLOOKUP($A31,'GPU001'!$A:$J,5,FALSE))","v":""},{"$f":"IF($B31,\"\",VLOOKUP($A31,'GPU001'!$A:$J,6,FALSE))","v":""},{"$f":"IF($B31,\"\",VLOOKUP($A31,'GPU001'!$A:$J,7,FALSE))","v":""},{"$f":"IF($B31,\"\",VLOOKUP($A31,'GPU001'!$A:$J,8,FALSE))","v":""},null,null,null,null,null,null,null,null,null,null,null,null,null,null,null,null,null,"",null,{"$f":"CONCATENATE(\"2/6/\",$AK$12)","v":"2/6/arn"},{"$f":"(ISERROR(VLOOKUP($AB31,'GPU001'!$A:$J,6,FALSE)))","v":true},{"$f":"IF($AI31,\"\",VLOOKUP($AH31,'GPU001'!$B:$J,5,FALSE))","v":""},{"$f":"IF($AI31,\"\",VLOOKUP($AH31,'GPU001'!$B:$J,6,FALSE))","v":""},{"$f":"IF($AI31,\"\",VLOOKUP($AH31,'GPU001'!$B:$J,7,FALSE))","v":""},null,{"$f":"CONCATENATE(\"2/6/\",$AE$12)","v":"2/6/1a"},{"$f":"(ISERROR(VLOOKUP($AH31,'GPU001'!$B:$J,5,FALSE)))","v":true},{"$f":"IF($AC31,\"\",VLOOKUP($AB31,'GPU001'!$A:$J,5,FALSE))","v":""},{"$f":"IF($AC31,\"\",VLOOKUP($AB31,'GPU001'!$A:$J,7,FALSE))","v":""},{"$f":"IF($AC31,\"\",VLOOKUP($AB31,'GPU001'!$A:$J,8,FALSE))","v":""},null,{"$f":"CONCATENATE(\"2/6/\",$AQ$12)","v":"2/6/10"},{"$f":"(ISERROR(VLOOKUP($AN31,'GPU001'!$C:$J,4,FALSE)))","v":true},{"$f":"IF($AO31,\"\",VLOOKUP($AN31,'GPU001'!$C:$J,4,FALSE))","v":""},{"$f":"IF($AO31,\"\",VLOOKUP($AN31,'GPU001'!$C:$J,3,FALSE))","v":""},{"$f":"IF($AO31,\"\",VLOOKUP($AN31,'GPU001'!$C:$J,5,FALSE))","v":""}]
[{"$f":"CONCATENATE(\"2/7/\",$G$3)","v":"2/7/"},{"$f":"(ISERROR(VLOOKUP($A32,'GPU001'!$A:$J,6,FALSE)))","v":true},null,"Di 7",{"$f":"IF($B32,\"\",VLOOKUP($A32,'GPU001'!$A:$J,5,FALSE))","v":""},{"$f":"IF($B32,\"\",VLOOKUP($A32,'GPU001'!$A:$J,6,FALSE))","v":""},{"$f":"IF($B32,\"\",VLOOKUP($A32,'GPU001'!$A:$J,7,FALSE))","v":""},{"$f":"IF($B32,\"\",VLOOKUP($A32,'GPU001'!$A:$J,8,FALSE))","v":""},null,null,null,null,null,null,null,null,null,null,null,null,null,null,null,null,null,"",null,{"$f":"CONCATENATE(\"2/7/\",$AK$12)","v":"2/7/arn"},{"$f":"(ISERROR(VLOOKUP($AB32,'GPU001'!$A:$J,6,FALSE)))","v":false},{"$f":"IF($AI32,\"\",VLOOKUP($AH32,'GPU001'!$B:$J,5,FALSE))","v":"MEZ"},{"$f":"IF($AI32,\"\",VLOOKUP($AH32,'GPU001'!$B:$J,6,FALSE))","v":"NT"},{"$f":"IF($AI32,\"\",VLOOKUP($AH32,'GPU001'!$B:$J,7,FALSE))","v":"N07"},null,{"$f":"CONCATENATE(\"2/7/\",$AE$12)","v":"2/7/1a"},{"$f":"(ISERROR(VLOOKUP($AH32,'GPU001'!$B:$J,5,FALSE)))","v":false},{"$f":"IF($AC32,\"\",VLOOKUP($AB32,'GPU001'!$A:$J,5,FALSE))","v":"4D"},{"$f":"IF($AC32,\"\",VLOOKUP($AB32,'GPU001'!$A:$J,7,FALSE))","v":"DE"},{"$f":"IF($AC32,\"\",VLOOKUP($AB32,'GPU001'!$A:$J,8,FALSE))","v":213},null,{"$f":"CONCATENATE(\"2/7/\",$AQ$12)","v":"2/7/10"},{"$f":"(ISERROR(VLOOKUP($AN32,'GPU001'!$C:$J,4,FALSE)))","v":false},{"$f":"IF($AO32,\"\",VLOOKUP($AN32,'GPU001'!$C:$J,4,FALSE))","v":"GEU"},{"$f":"IF($AO32,\"\",VLOOKUP($AN32,'GPU001'!$C:$J,3,FALSE))","v":"2A"},{"$f":"IF($AO32,\"\",VLOOKUP($AN32,'GPU001'!$C:$J,5,FALSE))","v":"IN"}]
[{"$f":"CONCATENATE(\"2/8/\",$G$3)","v":"2/8/"},{"$f":"(ISERROR(VLOOKUP($A33,'GPU001'!$A:$J,6,FALSE)))","v":true},null,"Di 8",{"$f":"IF($B33,\"\",VLOOKUP($A33,'GPU001'!$A:$J,5,FALSE))","v":""},{"$f":"IF($B33,\"\",VLOOKUP($A33,'GPU001'!$A:$J,6,FALSE))","v":""},{"$f":"IF($B33,\"\",VLOOKUP($A33,'GPU001'!$A:$J,7,FALSE))","v":""},{"$f":"IF($B33,\"\",VLOOKUP($A33,'GPU001'!$A:$J,8,FALSE))","v":""},null,null,null,null,null,null,null,null,null,null,null,null,null,null,null,null,null,"",null,{"$f":"CONCATENATE(\"2/8/\",$AK$12)","v":"2/8/arn"},{"$f":"(ISERROR(VLOOKUP($AB33,'GPU001'!$A:$J,6,FALSE)))","v":false},{"$f":"IF($AI33,\"\",VLOOKUP($AH33,'GPU001'!$B:$J,5,FALSE))","v":"MEZ"},{"$f":"IF($AI33,\"\",VLOOKUP($AH33,'GPU001'!$B:$J,6,FALSE))","v":"NT"},{"$f":"IF($AI33,\"\",VLOOKUP($AH33,'GPU001'!$B:$J,7,FALSE))","v":"N07"},null,{"$f":"CONCATENATE(\"2/8/\",$AE$12)","v":"2/8/1a"},{"$f":"(ISERROR(VLOOKUP($AH33,'GPU001'!$B:$J,5,FALSE)))","v":false},{"$f":"IF($AC33,\"\",VLOOKUP($AB33,'GPU001'!$A:$J,5,FALSE))","v":"4D"},{"$f":"IF($AC33,\"\",VLOOKUP($AB33,'GPU001'!$A:$J,7,FALSE))","v":"DE"},{"$f":"IF($AC33,\"\",VLOOKUP($AB33,'GPU001'!$A:$J,8,FALSE))","v":213},null,{"$f":"CONCATENATE(\"2/8/\",$AQ$12)","v":"2/8/10"},{"$f":"(ISERROR(VLOOKUP($AN33,'GPU001'!$C:$J,4,FALSE)))","v":false},{"$f":"IF($AO33,\"\",VLOOKUP($AN33,'GPU001'!$C:$J,4,FALSE))","v":"GEU"},{"$f":"IF($AO33,\"\",VLOOKUP($AN33,'GPU001'!$C:$J,3,FALSE))","v":"2A"},{"$f":"IF($AO33,\"\",VLOOKUP($AN33,'GPU001'!$C:$J,5,FALSE))","v":"IN"}]
[{"$f":"CONCATENATE(\"2/9/\",$G$3)","v":"2/9/"},{"$f":"(ISERROR(VLOOKUP($A34,'GPU001'!$A:$J,6,FALSE)))","v":true},null,"Di 9",{"$f":"IF($B34,\"\",VLOOKUP($A34,'GPU001'!$A:$J,5,FALSE))","v":""},{"$f":"IF($B34,\"\",VLOOKUP($A34,'GPU001'!$A:$J,6,FALSE))","v":""},{"$f":"IF($B34,\"\",VLOOKUP($A34,'GPU001'!$A:$J,7,FALSE))","v":""},{"$f":"IF($B34,\"\",VLOOKUP($A34,'GPU001'!$A:$J,8,FALSE))","v":""},null,null,null,null,null,null,null,null,null,null,null,null,null,null,null,null,null,"",null,{"$f":"CONCATENATE(\"2/9/\",$AK$12)","v":"2/9/arn"},{"$f":"(ISERROR(VLOOKUP($AB34,'GPU001'!$A:$J,6,FALSE)))","v":false},{"$f":"IF($AI34,\"\",VLOOKUP($AH34,'GPU001'!$B:$J,5,FALSE))","v":"BRE"},{"$f":"IF($AI34,\"\",VLOOKUP($AH34,'GPU001'!$B:$J,6,FALSE))","v":"RE"},{"$f":"IF($AI34,\"\",VLOOKUP($AH34,'GPU001'!$B:$J,7,FALSE))","v":244},null,{"$f":"CONCATENATE(\"2/9/\",$AE$12)","v":"2/9/1a"},{"$f":"(ISERROR(VLOOKUP($AH34,'GPU001'!$B:$J,5,FALSE)))","v":false},{"$f":"IF($AC34,\"\",VLOOKUP($AB34,'GPU001'!$A:$J,5,FALSE))","v":"6K"},{"$f":"IF($AC34,\"\",VLOOKUP($AB34,'GPU001'!$A:$J,7,FALSE))","v":"DE"},{"$f":"IF($AC34,\"\",VLOOKUP($AB34,'GPU001'!$A:$J,8,FALSE))","v":213},null,{"$f":"CONCATENATE(\"2/9/\",$AQ$12)","v":"2/9/10"},{"$f":"(ISERROR(VLOOKUP($AN34,'GPU001'!$C:$J,4,FALSE)))","v":true},{"$f":"IF($AO34,\"\",VLOOKUP($AN34,'GPU001'!$C:$J,4,FALSE))","v":""},{"$f":"IF($AO34,\"\",VLOOKUP($AN34,'GPU001'!$C:$J,3,FALSE))","v":""},{"$f":"IF($AO34,\"\",VLOOKUP($AN34,'GPU001'!$C:$J,5,FALSE))","v":""}]
[{"$f":"CONCATENATE(\"2/10/\",$G$3)","v":"2/10/"},{"$f":"(ISERROR(VLOOKUP($A35,'GPU001'!$A:$J,6,FALSE)))","v":true},null,"Di 10",{"$f":"IF($B35,\"\",VLOOKUP($A35,'GPU001'!$A:$J,5,FALSE))","v":""},{"$f":"IF($B35,\"\",VLOOKUP($A35,'GPU001'!$A:$J,6,FALSE))","v":""},{"$f":"IF($B35,\"\",VLOOKUP($A35,'GPU001'!$A:$J,7,FALSE))","v":""},{"$f":"IF($B35,\"\",VLOOKUP($A35,'GPU001'!$A:$J,8,FALSE))","v":""},null,null,null,null,null,null,null,null,null,null,null,null,null,null,null,null,null,"",null,{"$f":"CONCATENATE(\"2/10/\",$AK$12)","v":"2/10/arn"},{"$f":"(ISERROR(VLOOKUP($AB35,'GPU001'!$A:$J,6,FALSE)))","v":false},{"$f":"IF($AI35,\"\",VLOOKUP($AH35,'GPU001'!$B:$J,5,FALSE))","v":"BRE"},{"$f":"IF($AI35,\"\",VLOOKUP($AH35,'GPU001'!$B:$J,6,FALSE))","v":"RE"},{"$f":"IF($AI35,\"\",VLOOKUP($AH35,'GPU001'!$B:$J,7,FALSE))","v":244},null,{"$f":"CONCATENATE(\"2/10/\",$AE$12)","v":"2/10/1a"},{"$f":"(ISERROR(VLOOKUP($AH35,'GPU001'!$B:$J,5,FALSE)))","v":false},{"$f":"IF($AC35,\"\",VLOOKUP($AB35,'GPU001'!$A:$J,5,FALSE))","v":"6K"},{"$f":"IF($AC35,\"\",VLOOKUP($AB35,'GPU001'!$A:$J,7,FALSE))","v":"DE"},{"$f":"IF($AC35,\"\",VLOOKUP($AB35,'GPU001'!$A:$J,8,FALSE))","v":213},null,{"$f":"CONCATENATE(\"2/10/\",$AQ$12)","v":"2/10/10"},{"$f":"(ISERROR(VLOOKUP($AN35,'GPU001'!$C:$J,4,FALSE)))","v":true},{"$f":"IF($AO35,\"\",VLOOKUP($AN35,'GPU001'!$C:$J,4,FALSE))","v":""},{"$f":"IF($AO35,\"\",VLOOKUP($AN35,'GPU001'!$C:$J,3,FALSE))","v":""},{"$f":"IF($AO35,\"\",VLOOKUP($AN35,'GPU001'!$C:$J,5,FALSE))","v":""}]
[{"$f":"CONCATENATE(\"2/11/\",$G$3)","v":"2/11/"},{"$f":"(ISERROR(VLOOKUP($A36,'GPU001'!$A:$J,6,FALSE)))","v":true},null,"Di 11",{"$f":"IF($B36,\"\",VLOOKUP($A36,'GPU001'!$A:$J,5,FALSE))","v":""},{"$f":"IF($B36,\"\",VLOOKUP($A36,'GPU001'!$A:$J,6,FALSE))","v":""},{"$f":"IF($B36,\"\",VLOOKUP($A36,'GPU001'!$A:$J,7,FALSE))","v":""},{"$f":"IF($B36,\"\",VLOOKUP($A36,'GPU001'!$A:$J,8,FALSE))","v":""},null,null,null,null,null,null,null,null,null,null,null,null,null,null,null,null,null,"",null,{"$f":"CONCATENATE(\"2/11/\",$AK$12)","v":"2/11/arn"},{"$f":"(ISERROR(VLOOKUP($AB36,'GPU001'!$A:$J,6,FALSE)))","v":true},{"$f":"IF($AI36,\"\",VLOOKUP($AH36,'GPU001'!$B:$J,5,FALSE))","v":""},{"$f":"IF($AI36,\"\",VLOOKUP($AH36,'GPU001'!$B:$J,6,FALSE))","v":""},{"$f":"IF($AI36,\"\",VLOOKUP($AH36,'GPU001'!$B:$J,7,FALSE))","v":""},null,{"$f":"CONCATENATE(\"2/11/\",$AE$12)","v":"2/11/1a"},{"$f":"(ISERROR(VLOOKUP($AH36,'GPU001'!$B:$J,5,FALSE)))","v":true},{"$f":"IF($AC36,\"\",VLOOKUP($AB36,'GPU001'!$A:$J,5,FALSE))","v":""},{"$f":"IF($AC36,\"\",VLOOKUP($AB36,'GPU001'!$A:$J,7,FALSE))","v":""},{"$f":"IF($AC36,\"\",VLOOKUP($AB36,'GPU001'!$A:$J,8,FALSE))","v":""},null,{"$f":"CONCATENATE(\"2/11/\",$AQ$12)","v":"2/11/10"},{"$f":"(ISERROR(VLOOKUP($AN36,'GPU001'!$C:$J,4,FALSE)))","v":true},{"$f":"IF($AO36,\"\",VLOOKUP($AN36,'GPU001'!$C:$J,4,FALSE))","v":""},{"$f":"IF($AO36,\"\",VLOOKUP($AN36,'GPU001'!$C:$J,3,FALSE))","v":""},{"$f":"IF($AO36,\"\",VLOOKUP($AN36,'GPU001'!$C:$J,5,FALSE))","v":""}]
[{"$f":"CONCATENATE(\"3/1/\",$G$3)","v":"3/1/"},{"$f":"(ISERROR(VLOOKUP($A37,'GPU001'!$A:$J,6,FALSE)))","v":true},{"$f":"IF(ISTEXT(C26),\"\",C26+1)","v":""},"Mi 1",{"$f":"IF($B37,\"\",VLOOKUP($A37,'GPU001'!$A:$J,5,FALSE))","v":""},{"$f":"IF($B37,\"\",VLOOKUP($A37,'GPU001'!$A:$J,6,FALSE))","v":""},{"$f":"IF($B37,\"\",VLOOKUP($A37,'GPU001'!$A:$J,7,FALSE))","v":""},{"$f":"IF($B37,\"\",VLOOKUP($A37,'GPU001'!$A:$J,8,FALSE))","v":""},null,null,null,null,null,null,null,null,null,null,null,null,null,null,null,null,null,"",null,{"$f":"CONCATENATE(\"3/1/\",$AK$12)","v":"3/1/arn"},{"$f":"(ISERROR(VLOOKUP($AB37,'GPU001'!$A:$J,6,FALSE)))","v":true},{"$f":"IF($AI37,\"\",VLOOKUP($AH37,'GPU001'!$B:$J,5,FALSE))","v":"KNE"},{"$f":"IF($AI37,\"\",VLOOKUP($AH37,'GPU001'!$B:$J,6,FALSE))","v":"GG"},{"$f":"IF($AI37,\"\",VLOOKUP($AH37,'GPU001'!$B:$J,7,FALSE))","v":115},null,{"$f":"CONCATENATE(\"3/1/\",$AE$12)","v":"3/1/1a"},{"$f":"(ISERROR(VLOOKUP($AH37,'GPU001'!$B:$J,5,FALSE)))","v":false},{"$f":"IF($AC37,\"\",VLOOKUP($AB37,'GPU001'!$A:$J,5,FALSE))","v":""},{"$f":"IF($AC37,\"\",VLOOKUP($AB37,'GPU001'!$A:$J,7,FALSE))","v":""},{"$f":"IF($AC37,\"\",VLOOKUP($AB37,'GPU001'!$A:$J,8,FALSE))","v":""},null,{"$f":"CONCATENATE(\"3/1/\",$AQ$12)","v":"3/1/10"},{"$f":"(ISERROR(VLOOKUP($AN37,'GPU001'!$C:$J,4,FALSE)))","v":true},{"$f":"IF($AO37,\"\",VLOOKUP($AN37,'GPU001'!$C:$J,4,FALSE))","v":""},{"$f":"IF($AO37,\"\",VLOOKUP($AN37,'GPU001'!$C:$J,3,FALSE))","v":""},{"$f":"IF($AO37,\"\",VLOOKUP($AN37,'GPU001'!$C:$J,5,FALSE))","v":""}]
[{"$f":"CONCATENATE(\"3/2/\",$G$3)","v":"3/2/"},{"$f":"(ISERROR(VLOOKUP($A38,'GPU001'!$A:$J,6,FALSE)))","v":true},null,"Mi 2",{"$f":"IF($B38,\"\",VLOOKUP($A38,'GPU001'!$A:$J,5,FALSE))","v":""},{"$f":"IF($B38,\"\",VLOOKUP($A38,'GPU001'!$A:$J,6,FALSE))","v":""},{"$f":"IF($B38,\"\",VLOOKUP($A38,'GPU001'!$A:$J,7,FALSE))","v":""},{"$f":"IF($B38,\"\",VLOOKUP($A38,'GPU001'!$A:$J,8,FALSE))","v":""},null,null,null,null,null,null,null,null,null,null,null,null,null,null,null,null,null,"",null,{"$f":"CONCATENATE(\"3/2/\",$AK$12)","v":"3/2/arn"},{"$f":"(ISERROR(VLOOKUP($AB38,'GPU001'!$A:$J,6,FALSE)))","v":true},{"$f":"IF($AI38,\"\",VLOOKUP($AH38,'GPU001'!$B:$J,5,FALSE))","v":"KNE"},{"$f":"IF($AI38,\"\",VLOOKUP($AH38,'GPU001'!$B:$J,6,FALSE))","v":"GG"},{"$f":"IF($AI38,\"\",VLOOKUP($AH38,'GPU001'!$B:$J,7,FALSE))","v":115},null,{"$f":"CONCATENATE(\"3/2/\",$AE$12)","v":"3/2/1a"},{"$f":"(ISERROR(VLOOKUP($AH38,'GPU001'!$B:$J,5,FALSE)))","v":false},{"$f":"IF($AC38,\"\",VLOOKUP($AB38,'GPU001'!$A:$J,5,FALSE))","v":""},{"$f":"IF($AC38,\"\",VLOOKUP($AB38,'GPU001'!$A:$J,7,FALSE))","v":""},{"$f":"IF($AC38,\"\",VLOOKUP($AB38,'GPU001'!$A:$J,8,FALSE))","v":""},null,{"$f":"CONCATENATE(\"3/2/\",$AQ$12)","v":"3/2/10"},{"$f":"(ISERROR(VLOOKUP($AN38,'GPU001'!$C:$J,4,FALSE)))","v":true},{"$f":"IF($AO38,\"\",VLOOKUP($AN38,'GPU001'!$C:$J,4,FALSE))","v":""},{"$f":"IF($AO38,\"\",VLOOKUP($AN38,'GPU001'!$C:$J,3,FALSE))","v":""},{"$f":"IF($AO38,\"\",VLOOKUP($AN38,'GPU001'!$C:$J,5,FALSE))","v":""}]
[{"$f":"CONCATENATE(\"3/3/\",$G$3)","v":"3/3/"},{"$f":"(ISERROR(VLOOKUP($A39,'GPU001'!$A:$J,6,FALSE)))","v":true},null,"Mi 3",{"$f":"IF($B39,\"\",VLOOKUP($A39,'GPU001'!$A:$J,5,FALSE))","v":""},{"$f":"IF($B39,\"\",VLOOKUP($A39,'GPU001'!$A:$J,6,FALSE))","v":""},{"$f":"IF($B39,\"\",VLOOKUP($A39,'GPU001'!$A:$J,7,FALSE))","v":""},{"$f":"IF($B39,\"\",VLOOKUP($A39,'GPU001'!$A:$J,8,FALSE))","v":""},null,null,null,null,null,null,null,null,null,null,null,null,null,null,null,null,null,"",null,{"$f":"CONCATENATE(\"3/3/\",$AK$12)","v":"3/3/arn"},{"$f":"(ISERROR(VLOOKUP($AB39,'GPU001'!$A:$J,6,FALSE)))","v":true},{"$f":"IF($AI39,\"\",VLOOKUP($AH39,'GPU001'!$B:$J,5,FALSE))","v":"KOR"},{"$f":"IF($AI39,\"\",VLOOKUP($AH39,'GPU001'!$B:$J,6,FALSE))","v":"DE"},{"$f":"IF($AI39,\"\",VLOOKUP($AH39,'GPU001'!$B:$J,7,FALSE))","v":214},null,{"$f":"CONCATENATE(\"3/3/\",$AE$12)","v":"3/3/1a"},{"$f":"(ISERROR(VLOOKUP($AH39,'GPU001'!$B:$J,5,FALSE)))","v":false},{"$f":"IF($AC39,\"\",VLOOKUP($AB39,'GPU001'!$A:$J,5,FALSE))","v":""},{"$f":"IF($AC39,\"\",VLOOKUP($AB39,'GPU001'!$A:$J,7,FALSE))","v":""},{"$f":"IF($AC39,\"\",VLOOKUP($AB39,'GPU001'!$A:$J,8,FALSE))","v":""},null,{"$f":"CONCATENATE(\"3/3/\",$AQ$12)","v":"3/3/10"},{"$f":"(ISERROR(VLOOKUP($AN39,'GPU001'!$C:$J,4,FALSE)))","v":true},{"$f":"IF($AO39,\"\",VLOOKUP($AN39,'GPU001'!$C:$J,4,FALSE))","v":""},{"$f":"IF($AO39,\"\",VLOOKUP($AN39,'GPU001'!$C:$J,3,FALSE))","v":""},{"$f":"IF($AO39,\"\",VLOOKUP($AN39,'GPU001'!$C:$J,5,FALSE))","v":""}]
[{"$f":"CONCATENATE(\"3/4/\",$G$3)","v":"3/4/"},{"$f":"(ISERROR(VLOOKUP($A40,'GPU001'!$A:$J,6,FALSE)))","v":true},null,"Mi 4",{"$f":"IF($B40,\"\",VLOOKUP($A40,'GPU001'!$A:$J,5,FALSE))","v":""},{"$f":"IF($B40,\"\",VLOOKUP($A40,'GPU001'!$A:$J,6,FALSE))","v":""},{"$f":"IF($B40,\"\",VLOOKUP($A40,'GPU001'!$A:$J,7,FALSE))","v":""},{"$f":"IF($B40,\"\",VLOOKUP($A40,'GPU001'!$A:$J,8,FALSE))","v":""},null,null,null,null,null,null,null,null,null,null,null,null,null,null,null,null,null,"",null,{"$f":"CONCATENATE(\"3/4/\",$AK$12)","v":"3/4/arn"},{"$f":"(ISERROR(VLOOKUP($AB40,'GPU001'!$A:$J,6,FALSE)))","v":true},{"$f":"IF($AI40,\"\",VLOOKUP($AH40,'GPU001'!$B:$J,5,FALSE))","v":"KOR"},{"$f":"IF($AI40,\"\",VLOOKUP($AH40,'GPU001'!$B:$J,6,FALSE))","v":"DE"},{"$f":"IF($AI40,\"\",VLOOKUP($AH40,'GPU001'!$B:$J,7,FALSE))","v":214},null,{"$f":"CONCATENATE(\"3/4/\",$AE$12)","v":"3/4/1a"},{"$f":"(ISERROR(VLOOKUP($AH40,'GPU001'!$B:$J,5,FALSE)))","v":false},{"$f":"IF($AC40,\"\",VLOOKUP($AB40,'GPU001'!$A:$J,5,FALSE))","v":""},{"$f":"IF($AC40,\"\",VLOOKUP($AB40,'GPU001'!$A:$J,7,FALSE))","v":""},{"$f":"IF($AC40,\"\",VLOOKUP($AB40,'GPU001'!$A:$J,8,FALSE))","v":""},null,{"$f":"CONCATENATE(\"3/4/\",$AQ$12)","v":"3/4/10"},{"$f":"(ISERROR(VLOOKUP($AN40,'GPU001'!$C:$J,4,FALSE)))","v":true},{"$f":"IF($AO40,\"\",VLOOKUP($AN40,'GPU001'!$C:$J,4,FALSE))","v":""},{"$f":"IF($AO40,\"\",VLOOKUP($AN40,'GPU001'!$C:$J,3,FALSE))","v":""},{"$f":"IF($AO40,\"\",VLOOKUP($AN40,'GPU001'!$C:$J,5,FALSE))","v":""}]
[{"$f":"CONCATENATE(\"3/5/\",$G$3)","v":"3/5/"},{"$f":"(ISERROR(VLOOKUP($A41,'GPU001'!$A:$J,6,FALSE)))","v":true},null,"Mi 5",{"$f":"IF($B41,\"\",VLOOKUP($A41,'GPU001'!$A:$J,5,FALSE))","v":""},{"$f":"IF($B41,\"\",VLOOKUP($A41,'GPU001'!$A:$J,6,FALSE))","v":""},{"$f":"IF($B41,\"\",VLOOKUP($A41,'GPU001'!$A:$J,7,FALSE))","v":""},{"$f":"IF($B41,\"\",VLOOKUP($A41,'GPU001'!$A:$J,8,FALSE))","v":""},null,null,null,null,null,null,null,null,null,null,null,null,null,null,null,null,null,"",null,{"$f":"CONCATENATE(\"3/5/\",$AK$12)","v":"3/5/arn"},{"$f":"(ISERROR(VLOOKUP($AB41,'GPU001'!$A:$J,6,FALSE)))","v":true},{"$f":"IF($AI41,\"\",VLOOKUP($AH41,'GPU001'!$B:$J,5,FALSE))","v":""},{"$f":"IF($AI41,\"\",VLOOKUP($AH41,'GPU001'!$B:$J,6,FALSE))","v":""},{"$f":"IF($AI41,\"\",VLOOKUP($AH41,'GPU001'!$B:$J,7,FALSE))","v":""},null,{"$f":"CONCATENATE(\"3/5/\",$AE$12)","v":"3/5/1a"},{"$f":"(ISERROR(VLOOKUP($AH41,'GPU001'!$B:$J,5,FALSE)))","v":true},{"$f":"IF($AC41,\"\",VLOOKUP($AB41,'GPU001'!$A:$J,5,FALSE))","v":""},{"$f":"IF($AC41,\"\",VLOOKUP($AB41,'GPU001'!$A:$J,7,FALSE))","v":""},{"$f":"IF($AC41,\"\",VLOOKUP($AB41,'GPU001'!$A:$J,8,FALSE))","v":""},null,{"$f":"CONCATENATE(\"3/5/\",$AQ$12)","v":"3/5/10"},{"$f":"(ISERROR(VLOOKUP($AN41,'GPU001'!$C:$J,4,FALSE)))","v":true},{"$f":"IF($AO41,\"\",VLOOKUP($AN41,'GPU001'!$C:$J,4,FALSE))","v":""},{"$f":"IF($AO41,\"\",VLOOKUP($AN41,'GPU001'!$C:$J,3,FALSE))","v":""},{"$f":"IF($AO41,\"\",VLOOKUP($AN41,'GPU001'!$C:$J,5,FALSE))","v":""}]
[{"$f":"CONCATENATE(\"3/6/\",$G$3)","v":"3/6/"},{"$f":"(ISERROR(VLOOKUP($A42,'GPU001'!$A:$J,6,FALSE)))","v":true},null,"Mi 6",{"$f":"IF($B42,\"\",VLOOKUP($A42,'GPU001'!$A:$J,5,FALSE))","v":""},{"$f":"IF($B42,\"\",VLOOKUP($A42,'GPU001'!$A:$J,6,FALSE))","v":""},{"$f":"IF($B42,\"\",VLOOKUP($A42,'GPU001'!$A:$J,7,FALSE))","v":""},{"$f":"IF($B42,\"\",VLOOKUP($A42,'GPU001'!$A:$J,8,FALSE))","v":""},null,null,null,null,null,null,null,null,null,null,null,null,null,null,null,null,null,"",null,{"$f":"CONCATENATE(\"3/6/\",$AK$12)","v":"3/6/arn"},{"$f":"(ISERROR(VLOOKUP($AB42,'GPU001'!$A:$J,6,FALSE)))","v":true},{"$f":"IF($AI42,\"\",VLOOKUP($AH42,'GPU001'!$B:$J,5,FALSE))","v":""},{"$f":"IF($AI42,\"\",VLOOKUP($AH42,'GPU001'!$B:$J,6,FALSE))","v":""},{"$f":"IF($AI42,\"\",VLOOKUP($AH42,'GPU001'!$B:$J,7,FALSE))","v":""},null,{"$f":"CONCATENATE(\"3/6/\",$AE$12)","v":"3/6/1a"},{"$f":"(ISERROR(VLOOKUP($AH42,'GPU001'!$B:$J,5,FALSE)))","v":true},{"$f":"IF($AC42,\"\",VLOOKUP($AB42,'GPU001'!$A:$J,5,FALSE))","v":""},{"$f":"IF($AC42,\"\",VLOOKUP($AB42,'GPU001'!$A:$J,7,FALSE))","v":""},{"$f":"IF($AC42,\"\",VLOOKUP($AB42,'GPU001'!$A:$J,8,FALSE))","v":""},null,{"$f":"CONCATENATE(\"3/6/\",$AQ$12)","v":"3/6/10"},{"$f":"(ISERROR(VLOOKUP($AN42,'GPU001'!$C:$J,4,FALSE)))","v":true},{"$f":"IF($AO42,\"\",VLOOKUP($AN42,'GPU001'!$C:$J,4,FALSE))","v":""},{"$f":"IF($AO42,\"\",VLOOKUP($AN42,'GPU001'!$C:$J,3,FALSE))","v":""},{"$f":"IF($AO42,\"\",VLOOKUP($AN42,'GPU001'!$C:$J,5,FALSE))","v":""}]
[{"$f":"CONCATENATE(\"3/7/\",$G$3)","v":"3/7/"},{"$f":"(ISERROR(VLOOKUP($A43,'GPU001'!$A:$J,6,FALSE)))","v":true},null,"Mi 7",{"$f":"IF($B43,\"\",VLOOKUP($A43,'GPU001'!$A:$J,5,FALSE))","v":""},{"$f":"IF($B43,\"\",VLOOKUP($A43,'GPU001'!$A:$J,6,FALSE))","v":""},{"$f":"IF($B43,\"\",VLOOKUP($A43,'GPU001'!$A:$J,7,FALSE))","v":""},{"$f":"IF($B43,\"\",VLOOKUP($A43,'GPU001'!$A:$J,8,FALSE))","v":""},null,null,null,null,null,null,null,null,null,null,null,null,null,null,null,null,null,"",null,{"$f":"CONCATENATE(\"3/7/\",$AK$12)","v":"3/7/arn"},{"$f":"(ISERROR(VLOOKUP($AB43,'GPU001'!$A:$J,6,FALSE)))","v":false},{"$f":"IF($AI43,\"\",VLOOKUP($AH43,'GPU001'!$B:$J,5,FALSE))","v":""},{"$f":"IF($AI43,\"\",VLOOKUP($AH43,'GPU001'!$B:$J,6,FALSE))","v":""},{"$f":"IF($AI43,\"\",VLOOKUP($AH43,'GPU001'!$B:$J,7,FALSE))","v":""},null,{"$f":"CONCATENATE(\"3/7/\",$AE$12)","v":"3/7/1a"},{"$f":"(ISERROR(VLOOKUP($AH43,'GPU001'!$B:$J,5,FALSE)))","v":true},{"$f":"IF($AC43,\"\",VLOOKUP($AB43,'GPU001'!$A:$J,5,FALSE))","v":"5E"},{"$f":"IF($AC43,\"\",VLOOKUP($AB43,'GPU001'!$A:$J,7,FALSE))","v":"DE"},{"$f":"IF($AC43,\"\",VLOOKUP($AB43,'GPU001'!$A:$J,8,FALSE))","v":213},null,{"$f":"CONCATENATE(\"3/7/\",$AQ$12)","v":"3/7/10"},{"$f":"(ISERROR(VLOOKUP($AN43,'GPU001'!$C:$J,4,FALSE)))","v":true},{"$f":"IF($AO43,\"\",VLOOKUP($AN43,'GPU001'!$C:$J,4,FALSE))","v":""},{"$f":"IF($AO43,\"\",VLOOKUP($AN43,'GPU001'!$C:$J,3,FALSE))","v":""},{"$f":"IF($AO43,\"\",VLOOKUP($AN43,'GPU001'!$C:$J,5,FALSE))","v":""}]
[{"$f":"CONCATENATE(\"3/8/\",$G$3)","v":"3/8/"},{"$f":"(ISERROR(VLOOKUP($A44,'GPU001'!$A:$J,6,FALSE)))","v":true},null,"Mi 8",{"$f":"IF($B44,\"\",VLOOKUP($A44,'GPU001'!$A:$J,5,FALSE))","v":""},{"$f":"IF($B44,\"\",VLOOKUP($A44,'GPU001'!$A:$J,6,FALSE))","v":""},{"$f":"IF($B44,\"\",VLOOKUP($A44,'GPU001'!$A:$J,7,FALSE))","v":""},{"$f":"IF($B44,\"\",VLOOKUP($A44,'GPU001'!$A:$J,8,FALSE))","v":""},null,null,null,null,null,null,null,null,null,null,null,null,null,null,null,null,null,"",null,{"$f":"CONCATENATE(\"3/8/\",$AK$12)","v":"3/8/arn"},{"$f":"(ISERROR(VLOOKUP($AB44,'GPU001'!$A:$J,6,FALSE)))","v":false},{"$f":"IF($AI44,\"\",VLOOKUP($AH44,'GPU001'!$B:$J,5,FALSE))","v":""},{"$f":"IF($AI44,\"\",VLOOKUP($AH44,'GPU001'!$B:$J,6,FALSE))","v":""},{"$f":"IF($AI44,\"\",VLOOKUP($AH44,'GPU001'!$B:$J,7,FALSE))","v":""},null,{"$f":"CONCATENATE(\"3/8/\",$AE$12)","v":"3/8/1a"},{"$f":"(ISERROR(VLOOKUP($AH44,'GPU001'!$B:$J,5,FALSE)))","v":true},{"$f":"IF($AC44,\"\",VLOOKUP($AB44,'GPU001'!$A:$J,5,FALSE))","v":"5E"},{"$f":"IF($AC44,\"\",VLOOKUP($AB44,'GPU001'!$A:$J,7,FALSE))","v":"DE"},{"$f":"IF($AC44,\"\",VLOOKUP($AB44,'GPU001'!$A:$J,8,FALSE))","v":213},null,{"$f":"CONCATENATE(\"3/8/\",$AQ$12)","v":"3/8/10"},{"$f":"(ISERROR(VLOOKUP($AN44,'GPU001'!$C:$J,4,FALSE)))","v":true},{"$f":"IF($AO44,\"\",VLOOKUP($AN44,'GPU001'!$C:$J,4,FALSE))","v":""},{"$f":"IF($AO44,\"\",VLOOKUP($AN44,'GPU001'!$C:$J,3,FALSE))","v":""},{"$f":"IF($AO44,\"\",VLOOKUP($AN44,'GPU001'!$C:$J,5,FALSE))","v":""}]
[{"$f":"CONCATENATE(\"3/9/\",$G$3)","v":"3/9/"},{"$f":"(ISERROR(VLOOKUP($A45,'GPU001'!$A:$J,6,FALSE)))","v":true},null,"Mi 9",{"$f":"IF($B45,\"\",VLOOKUP($A45,'GPU001'!$A:$J,5,FALSE))","v":""},{"$f":"IF($B45,\"\",VLOOKUP($A45,'GPU001'!$A:$J,6,FALSE))","v":""},{"$f":"IF($B45,\"\",VLOOKUP($A45,'GPU001'!$A:$J,7,FALSE))","v":""},{"$f":"IF($B45,\"\",VLOOKUP($A45,'GPU001'!$A:$J,8,FALSE))","v":""},null,null,null,null,null,null,null,null,null,null,null,null,null,null,null,null,null,"",null,{"$f":"CONCATENATE(\"3/9/\",$AK$12)","v":"3/9/arn"},{"$f":"(ISERROR(VLOOKUP($AB45,'GPU001'!$A:$J,6,FALSE)))","v":true},{"$f":"IF($AI45,\"\",VLOOKUP($AH45,'GPU001'!$B:$J,5,FALSE))","v":""},{"$f":"IF($AI45,\"\",VLOOKUP($AH45,'GPU001'!$B:$J,6,FALSE))","v":""},{"$f":"IF($AI45,\"\",VLOOKUP($AH45,'GPU001'!$B:$J,7,FALSE))","v":""},null,{"$f":"CONCATENATE(\"3/9/\",$AE$12)","v":"3/9/1a"},{"$f":"(ISERROR(VLOOKUP($AH45,'GPU001'!$B:$J,5,FALSE)))","v":true},{"$f":"IF($AC45,\"\",VLOOKUP($AB45,'GPU001'!$A:$J,5,FALSE))","v":""},{"$f":"IF($AC45,\"\",VLOOKUP($AB45,'GPU001'!$A:$J,7,FALSE))","v":""},{"$f":"IF($AC45,\"\",VLOOKUP($AB45,'GPU001'!$A:$J,8,FALSE))","v":""},null,{"$f":"CONCATENATE(\"3/9/\",$AQ$12)","v":"3/9/10"},{"$f":"(ISERROR(VLOOKUP($AN45,'GPU001'!$C:$J,4,FALSE)))","v":true},{"$f":"IF($AO45,\"\",VLOOKUP($AN45,'GPU001'!$C:$J,4,FALSE))","v":""},{"$f":"IF($AO45,\"\",VLOOKUP($AN45,'GPU001'!$C:$J,3,FALSE))","v":""},{"$f":"IF($AO45,\"\",VLOOKUP($AN45,'GPU001'!$C:$J,5,FALSE))","v":""}]
[{"$f":"CONCATENATE(\"3/10/\",$G$3)","v":"3/10/"},{"$f":"(ISERROR(VLOOKUP($A46,'GPU001'!$A:$J,6,FALSE)))","v":true},null,"Mi 10",{"$f":"IF($B46,\"\",VLOOKUP($A46,'GPU001'!$A:$J,5,FALSE))","v":""},{"$f":"IF($B46,\"\",VLOOKUP($A46,'GPU001'!$A:$J,6,FALSE))","v":""},{"$f":"IF($B46,\"\",VLOOKUP($A46,'GPU001'!$A:$J,7,FALSE))","v":""},{"$f":"IF($B46,\"\",VLOOKUP($A46,'GPU001'!$A:$J,8,FALSE))","v":""},null,null,null,null,null,null,null,null,null,null,null,null,null,null,null,null,null,"",null,{"$f":"CONCATENATE(\"3/10/\",$AK$12)","v":"3/10/arn"},{"$f":"(ISERROR(VLOOKUP($AB46,'GPU001'!$A:$J,6,FALSE)))","v":true},{"$f":"IF($AI46,\"\",VLOOKUP($AH46,'GPU001'!$B:$J,5,FALSE))","v":""},{"$f":"IF($AI46,\"\",VLOOKUP($AH46,'GPU001'!$B:$J,6,FALSE))","v":""},{"$f":"IF($AI46,\"\",VLOOKUP($AH46,'GPU001'!$B:$J,7,FALSE))","v":""},null,{"$f":"CONCATENATE(\"3/10/\",$AE$12)","v":"3/10/1a"},{"$f":"(ISERROR(VLOOKUP($AH46,'GPU001'!$B:$J,5,FALSE)))","v":true},{"$f":"IF($AC46,\"\",VLOOKUP($AB46,'GPU001'!$A:$J,5,FALSE))","v":""},{"$f":"IF($AC46,\"\",VLOOKUP($AB46,'GPU001'!$A:$J,7,FALSE))","v":""},{"$f":"IF($AC46,\"\",VLOOKUP($AB46,'GPU001'!$A:$J,8,FALSE))","v":""},null,{"$f":"CONCATENATE(\"3/10/\",$AQ$12)","v":"3/10/10"},{"$f":"(ISERROR(VLOOKUP($AN46,'GPU001'!$C:$J,4,FALSE)))","v":true},{"$f":"IF($AO46,\"\",VLOOKUP($AN46,'GPU001'!$C:$J,4,FALSE))","v":""},{"$f":"IF($AO46,\"\",VLOOKUP($AN46,'GPU001'!$C:$J,3,FALSE))","v":""},{"$f":"IF($AO46,\"\",VLOOKUP($AN46,'GPU001'!$C:$J,5,FALSE))","v":""}]
[{"$f":"CONCATENATE(\"3/11/\",$G$3)","v":"3/11/"},{"$f":"(ISERROR(VLOOKUP($A47,'GPU001'!$A:$J,6,FALSE)))","v":true},null,"Mi 11",{"$f":"IF($B47,\"\",VLOOKUP($A47,'GPU001'!$A:$J,5,FALSE))","v":""},{"$f":"IF($B47,\"\",VLOOKUP($A47,'GPU001'!$A:$J,6,FALSE))","v":""},{"$f":"IF($B47,\"\",VLOOKUP($A47,'GPU001'!$A:$J,7,FALSE))","v":""},{"$f":"IF($B47,\"\",VLOOKUP($A47,'GPU001'!$A:$J,8,FALSE))","v":""},null,null,null,null,null,null,null,null,null,null,null,null,null,null,null,null,null,"",null,{"$f":"CONCATENATE(\"3/11/\",$AK$12)","v":"3/11/arn"},{"$f":"(ISERROR(VLOOKUP($AB47,'GPU001'!$A:$J,6,FALSE)))","v":true},{"$f":"IF($AI47,\"\",VLOOKUP($AH47,'GPU001'!$B:$J,5,FALSE))","v":""},{"$f":"IF($AI47,\"\",VLOOKUP($AH47,'GPU001'!$B:$J,6,FALSE))","v":""},{"$f":"IF($AI47,\"\",VLOOKUP($AH47,'GPU001'!$B:$J,7,FALSE))","v":""},null,{"$f":"CONCATENATE(\"3/11/\",$AE$12)","v":"3/11/1a"},{"$f":"(ISERROR(VLOOKUP($AH47,'GPU001'!$B:$J,5,FALSE)))","v":true},{"$f":"IF($AC47,\"\",VLOOKUP($AB47,'GPU001'!$A:$J,5,FALSE))","v":""},{"$f":"IF($AC47,\"\",VLOOKUP($AB47,'GPU001'!$A:$J,7,FALSE))","v":""},{"$f":"IF($AC47,\"\",VLOOKUP($AB47,'GPU001'!$A:$J,8,FALSE))","v":""},null,{"$f":"CONCATENATE(\"3/11/\",$AQ$12)","v":"3/11/10"},{"$f":"(ISERROR(VLOOKUP($AN47,'GPU001'!$C:$J,4,FALSE)))","v":true},{"$f":"IF($AO47,\"\",VLOOKUP($AN47,'GPU001'!$C:$J,4,FALSE))","v":""},{"$f":"IF($AO47,\"\",VLOOKUP($AN47,'GPU001'!$C:$J,3,FALSE))","v":""},{"$f":"IF($AO47,\"\",VLOOKUP($AN47,'GPU001'!$C:$J,5,FALSE))","v":""}]
[{"$f":"CONCATENATE(\"4/1/\",$G$3)","v":"4/1/"},{"$f":"(ISERROR(VLOOKUP($A48,'GPU001'!$A:$J,6,FALSE)))","v":true},{"$f":"IF(ISTEXT(C37),\"\",C37+1)","v":""},"Do 1",{"$f":"IF($B48,\"\",VLOOKUP($A48,'GPU001'!$A:$J,5,FALSE))","v":""},{"$f":"IF($B48,\"\",VLOOKUP($A48,'GPU001'!$A:$J,6,FALSE))","v":""},{"$f":"IF($B48,\"\",VLOOKUP($A48,'GPU001'!$A:$J,7,FALSE))","v":""},{"$f":"IF($B48,\"\",VLOOKUP($A48,'GPU001'!$A:$J,8,FALSE))","v":""},null,null,null,null,null,null,null,null,null,null,null,null,null,null,null,null,null,"",null,{"$f":"CONCATENATE(\"4/1/\",$AK$12)","v":"4/1/arn"},{"$f":"(ISERROR(VLOOKUP($AB48,'GPU001'!$A:$J,6,FALSE)))","v":false},{"$f":"IF($AI48,\"\",VLOOKUP($AH48,'GPU001'!$B:$J,5,FALSE))","v":"GRM"},{"$f":"IF($AI48,\"\",VLOOKUP($AH48,'GPU001'!$B:$J,6,FALSE))","v":"SH"},{"$f":"IF($AI48,\"\",VLOOKUP($AH48,'GPU001'!$B:$J,7,FALSE))","v":"THU"},null,{"$f":"CONCATENATE(\"4/1/\",$AE$12)","v":"4/1/1a"},{"$f":"(ISERROR(VLOOKUP($AH48,'GPU001'!$B:$J,5,FALSE)))","v":false},{"$f":"IF($AC48,\"\",VLOOKUP($AB48,'GPU001'!$A:$J,5,FALSE))","v":"6K"},{"$f":"IF($AC48,\"\",VLOOKUP($AB48,'GPU001'!$A:$J,7,FALSE))","v":"DE"},{"$f":"IF($AC48,\"\",VLOOKUP($AB48,'GPU001'!$A:$J,8,FALSE))","v":213},null,{"$f":"CONCATENATE(\"4/1/\",$AQ$12)","v":"4/1/10"},{"$f":"(ISERROR(VLOOKUP($AN48,'GPU001'!$C:$J,4,FALSE)))","v":true},{"$f":"IF($AO48,\"\",VLOOKUP($AN48,'GPU001'!$C:$J,4,FALSE))","v":""},{"$f":"IF($AO48,\"\",VLOOKUP($AN48,'GPU001'!$C:$J,3,FALSE))","v":""},{"$f":"IF($AO48,\"\",VLOOKUP($AN48,'GPU001'!$C:$J,5,FALSE))","v":""}]
[{"$f":"CONCATENATE(\"4/2/\",$G$3)","v":"4/2/"},{"$f":"(ISERROR(VLOOKUP($A49,'GPU001'!$A:$J,6,FALSE)))","v":true},null,"Do 2",{"$f":"IF($B49,\"\",VLOOKUP($A49,'GPU001'!$A:$J,5,FALSE))","v":""},{"$f":"IF($B49,\"\",VLOOKUP($A49,'GPU001'!$A:$J,6,FALSE))","v":""},{"$f":"IF($B49,\"\",VLOOKUP($A49,'GPU001'!$A:$J,7,FALSE))","v":""},{"$f":"IF($B49,\"\",VLOOKUP($A49,'GPU001'!$A:$J,8,FALSE))","v":""},null,null,null,null,null,null,null,null,null,null,null,null,null,null,null,null,null,"",null,{"$f":"CONCATENATE(\"4/2/\",$AK$12)","v":"4/2/arn"},{"$f":"(ISERROR(VLOOKUP($AB49,'GPU001'!$A:$J,6,FALSE)))","v":false},{"$f":"IF($AI49,\"\",VLOOKUP($AH49,'GPU001'!$B:$J,5,FALSE))","v":"GRB"},{"$f":"IF($AI49,\"\",VLOOKUP($AH49,'GPU001'!$B:$J,6,FALSE))","v":"FR"},{"$f":"IF($AI49,\"\",VLOOKUP($AH49,'GPU001'!$B:$J,7,FALSE))","v":14},null,{"$f":"CONCATENATE(\"4/2/\",$AE$12)","v":"4/2/1a"},{"$f":"(ISERROR(VLOOKUP($AH49,'GPU001'!$B:$J,5,FALSE)))","v":false},{"$f":"IF($AC49,\"\",VLOOKUP($AB49,'GPU001'!$A:$J,5,FALSE))","v":"6K"},{"$f":"IF($AC49,\"\",VLOOKUP($AB49,'GPU001'!$A:$J,7,FALSE))","v":"DE"},{"$f":"IF($AC49,\"\",VLOOKUP($AB49,'GPU001'!$A:$J,8,FALSE))","v":213},null,{"$f":"CONCATENATE(\"4/2/\",$AQ$12)","v":"4/2/10"},{"$f":"(ISERROR(VLOOKUP($AN49,'GPU001'!$C:$J,4,FALSE)))","v":false},{"$f":"IF($AO49,\"\",VLOOKUP($AN49,'GPU001'!$C:$J,4,FALSE))","v":"GUT"},{"$f":"IF($AO49,\"\",VLOOKUP($AN49,'GPU001'!$C:$J,3,FALSE))","v":"1G"},{"$f":"IF($AO49,\"\",VLOOKUP($AN49,'GPU001'!$C:$J,5,FALSE))","v":"IN"}]
[{"$f":"CONCATENATE(\"4/3/\",$G$3)","v":"4/3/"},{"$f":"(ISERROR(VLOOKUP($A50,'GPU001'!$A:$J,6,FALSE)))","v":true},null,"Do 3",{"$f":"IF($B50,\"\",VLOOKUP($A50,'GPU001'!$A:$J,5,FALSE))","v":""},{"$f":"IF($B50,\"\",VLOOKUP($A50,'GPU001'!$A:$J,6,FALSE))","v":""},{"$f":"IF($B50,\"\",VLOOKUP($A50,'GPU001'!$A:$J,7,FALSE))","v":""},{"$f":"IF($B50,\"\",VLOOKUP($A50,'GPU001'!$A:$J,8,FALSE))","v":""},null,null,null,null,null,null,null,null,null,null,null,null,null,null,null,null,null,"",null,{"$f":"CONCATENATE(\"4/3/\",$AK$12)","v":"4/3/arn"},{"$f":"(ISERROR(VLOOKUP($AB50,'GPU001'!$A:$J,6,FALSE)))","v":false},{"$f":"IF($AI50,\"\",VLOOKUP($AH50,'GPU001'!$B:$J,5,FALSE))","v":"CON"},{"$f":"IF($AI50,\"\",VLOOKUP($AH50,'GPU001'!$B:$J,6,FALSE))","v":"MA"},{"$f":"IF($AI50,\"\",VLOOKUP($AH50,'GPU001'!$B:$J,7,FALSE))","v":112},null,{"$f":"CONCATENATE(\"4/3/\",$AE$12)","v":"4/3/1a"},{"$f":"(ISERROR(VLOOKUP($AH50,'GPU001'!$B:$J,5,FALSE)))","v":false},{"$f":"IF($AC50,\"\",VLOOKUP($AB50,'GPU001'!$A:$J,5,FALSE))","v":"4D"},{"$f":"IF($AC50,\"\",VLOOKUP($AB50,'GPU001'!$A:$J,7,FALSE))","v":"DE"},{"$f":"IF($AC50,\"\",VLOOKUP($AB50,'GPU001'!$A:$J,8,FALSE))","v":213},null,{"$f":"CONCATENATE(\"4/3/\",$AQ$12)","v":"4/3/10"},{"$f":"(ISERROR(VLOOKUP($AN50,'GPU001'!$C:$J,4,FALSE)))","v":false},{"$f":"IF($AO50,\"\",VLOOKUP($AN50,'GPU001'!$C:$J,4,FALSE))","v":"GUT"},{"$f":"IF($AO50,\"\",VLOOKUP($AN50,'GPU001'!$C:$J,3,FALSE))","v":"1F"},{"$f":"IF($AO50,\"\",VLOOKUP($AN50,'GPU001'!$C:$J,5,FALSE))","v":"IN"}]
[{"$f":"CONCATENATE(\"4/4/\",$G$3)","v":"4/4/"},{"$f":"(ISERROR(VLOOKUP($A51,'GPU001'!$A:$J,6,FALSE)))","v":true},null,"Do 4",{"$f":"IF($B51,\"\",VLOOKUP($A51,'GPU001'!$A:$J,5,FALSE))","v":""},{"$f":"IF($B51,\"\",VLOOKUP($A51,'GPU001'!$A:$J,6,FALSE))","v":""},{"$f":"IF($B51,\"\",VLOOKUP($A51,'GPU001'!$A:$J,7,FALSE))","v":""},{"$f":"IF($B51,\"\",VLOOKUP($A51,'GPU001'!$A:$J,8,FALSE))","v":""},null,null,null,null,null,null,null,null,null,null,null,null,null,null,null,null,null,"",null,{"$f":"CONCATENATE(\"4/4/\",$AK$12)","v":"4/4/arn"},{"$f":"(ISERROR(VLOOKUP($AB51,'GPU001'!$A:$J,6,FALSE)))","v":false},{"$f":"IF($AI51,\"\",VLOOKUP($AH51,'GPU001'!$B:$J,5,FALSE))","v":"CON"},{"$f":"IF($AI51,\"\",VLOOKUP($AH51,'GPU001'!$B:$J,6,FALSE))","v":"MA"},{"$f":"IF($AI51,\"\",VLOOKUP($AH51,'GPU001'!$B:$J,7,FALSE))","v":112},null,{"$f":"CONCATENATE(\"4/4/\",$AE$12)","v":"4/4/1a"},{"$f":"(ISERROR(VLOOKUP($AH51,'GPU001'!$B:$J,5,FALSE)))","v":false},{"$f":"IF($AC51,\"\",VLOOKUP($AB51,'GPU001'!$A:$J,5,FALSE))","v":"4D"},{"$f":"IF($AC51,\"\",VLOOKUP($AB51,'GPU001'!$A:$J,7,FALSE))","v":"DE"},{"$f":"IF($AC51,\"\",VLOOKUP($AB51,'GPU001'!$A:$J,8,FALSE))","v":213},null,{"$f":"CONCATENATE(\"4/4/\",$AQ$12)","v":"4/4/10"},{"$f":"(ISERROR(VLOOKUP($AN51,'GPU001'!$C:$J,4,FALSE)))","v":false},{"$f":"IF($AO51,\"\",VLOOKUP($AN51,'GPU001'!$C:$J,4,FALSE))","v":"GUT"},{"$f":"IF($AO51,\"\",VLOOKUP($AN51,'GPU001'!$C:$J,3,FALSE))","v":"1E"},{"$f":"IF($AO51,\"\",VLOOKUP($AN51,'GPU001'!$C:$J,5,FALSE))","v":"IN"}]
[{"$f":"CONCATENATE(\"4/5/\",$G$3)","v":"4/5/"},{"$f":"(ISERROR(VLOOKUP($A52,'GPU001'!$A:$J,6,FALSE)))","v":true},null,"Do 5",{"$f":"IF($B52,\"\",VLOOKUP($A52,'GPU001'!$A:$J,5,FALSE))","v":""},{"$f":"IF($B52,\"\",VLOOKUP($A52,'GPU001'!$A:$J,6,FALSE))","v":""},{"$f":"IF($B52,\"\",VLOOKUP($A52,'GPU001'!$A:$J,7,FALSE))","v":""},{"$f":"IF($B52,\"\",VLOOKUP($A52,'GPU001'!$A:$J,8,FALSE))","v":""},null,null,null,null,null,null,null,null,null,null,null,null,null,null,null,null,null,"",null,{"$f":"CONCATENATE(\"4/5/\",$AK$12)","v":"4/5/arn"},{"$f":"(ISERROR(VLOOKUP($AB52,'GPU001'!$A:$J,6,FALSE)))","v":true},{"$f":"IF($AI52,\"\",VLOOKUP($AH52,'GPU001'!$B:$J,5,FALSE))","v":""},{"$f":"IF($AI52,\"\",VLOOKUP($AH52,'GPU001'!$B:$J,6,FALSE))","v":""},{"$f":"IF($AI52,\"\",VLOOKUP($AH52,'GPU001'!$B:$J,7,FALSE))","v":""},null,{"$f":"CONCATENATE(\"4/5/\",$AE$12)","v":"4/5/1a"},{"$f":"(ISERROR(VLOOKUP($AH52,'GPU001'!$B:$J,5,FALSE)))","v":true},{"$f":"IF($AC52,\"\",VLOOKUP($AB52,'GPU001'!$A:$J,5,FALSE))","v":""},{"$f":"IF($AC52,\"\",VLOOKUP($AB52,'GPU001'!$A:$J,7,FALSE))","v":""},{"$f":"IF($AC52,\"\",VLOOKUP($AB52,'GPU001'!$A:$J,8,FALSE))","v":""},null,{"$f":"CONCATENATE(\"4/5/\",$AQ$12)","v":"4/5/10"},{"$f":"(ISERROR(VLOOKUP($AN52,'GPU001'!$C:$J,4,FALSE)))","v":false},{"$f":"IF($AO52,\"\",VLOOKUP($AN52,'GPU001'!$C:$J,4,FALSE))","v":"GHE"},{"$f":"IF($AO52,\"\",VLOOKUP($AN52,'GPU001'!$C:$J,3,FALSE))","v":"FKL"},{"$f":"IF($AO52,\"\",VLOOKUP($AN52,'GPU001'!$C:$J,5,FALSE))","v":"FIN1"}]
[{"$f":"CONCATENATE(\"4/6/\",$G$3)","v":"4/6/"},{"$f":"(ISERROR(VLOOKUP($A53,'GPU001'!$A:$J,6,FALSE)))","v":true},null,"Do 6",{"$f":"IF($B53,\"\",VLOOKUP($A53,'GPU001'!$A:$J,5,FALSE))","v":""},{"$f":"IF($B53,\"\",VLOOKUP($A53,'GPU001'!$A:$J,6,FALSE))","v":""},{"$f":"IF($B53,\"\",VLOOKUP($A53,'GPU001'!$A:$J,7,FALSE))","v":""},{"$f":"IF($B53,\"\",VLOOKUP($A53,'GPU001'!$A:$J,8,FALSE))","v":""},null,null,null,null,null,null,null,null,null,null,null,null,null,null,null,null,null,"",null,{"$f":"CONCATENATE(\"4/6/\",$AK$12)","v":"4/6/arn"},{"$f":"(ISERROR(VLOOKUP($AB53,'GPU001'!$A:$J,6,FALSE)))","v":true},{"$f":"IF($AI53,\"\",VLOOKUP($AH53,'GPU001'!$B:$J,5,FALSE))","v":""},{"$f":"IF($AI53,\"\",VLOOKUP($AH53,'GPU001'!$B:$J,6,FALSE))","v":""},{"$f":"IF($AI53,\"\",VLOOKUP($AH53,'GPU001'!$B:$J,7,FALSE))","v":""},null,{"$f":"CONCATENATE(\"4/6/\",$AE$12)","v":"4/6/1a"},{"$f":"(ISERROR(VLOOKUP($AH53,'GPU001'!$B:$J,5,FALSE)))","v":true},{"$f":"IF($AC53,\"\",VLOOKUP($AB53,'GPU001'!$A:$J,5,FALSE))","v":""},{"$f":"IF($AC53,\"\",VLOOKUP($AB53,'GPU001'!$A:$J,7,FALSE))","v":""},{"$f":"IF($AC53,\"\",VLOOKUP($AB53,'GPU001'!$A:$J,8,FALSE))","v":""},null,{"$f":"CONCATENATE(\"4/6/\",$AQ$12)","v":"4/6/10"},{"$f":"(ISERROR(VLOOKUP($AN53,'GPU001'!$C:$J,4,FALSE)))","v":true},{"$f":"IF($AO53,\"\",VLOOKUP($AN53,'GPU001'!$C:$J,4,FALSE))","v":""},{"$f":"IF($AO53,\"\",VLOOKUP($AN53,'GPU001'!$C:$J,3,FALSE))","v":""},{"$f":"IF($AO53,\"\",VLOOKUP($AN53,'GPU001'!$C:$J,5,FALSE))","v":""}]
[{"$f":"CONCATENATE(\"4/7/\",$G$3)","v":"4/7/"},{"$f":"(ISERROR(VLOOKUP($A54,'GPU001'!$A:$J,6,FALSE)))","v":true},null,"Do 7",{"$f":"IF($B54,\"\",VLOOKUP($A54,'GPU001'!$A:$J,5,FALSE))","v":""},{"$f":"IF($B54,\"\",VLOOKUP($A54,'GPU001'!$A:$J,6,FALSE))","v":""},{"$f":"IF($B54,\"\",VLOOKUP($A54,'GPU001'!$A:$J,7,FALSE))","v":""},{"$f":"IF($B54,\"\",VLOOKUP($A54,'GPU001'!$A:$J,8,FALSE))","v":""},null,null,null,null,null,null,null,null,null,null,null,null,null,null,null,null,null,"",null,{"$f":"CONCATENATE(\"4/7/\",$AK$12)","v":"4/7/arn"},{"$f":"(ISERROR(VLOOKUP($AB54,'GPU001'!$A:$J,6,FALSE)))","v":true},{"$f":"IF($AI54,\"\",VLOOKUP($AH54,'GPU001'!$B:$J,5,FALSE))","v":"BEL"},{"$f":"IF($AI54,\"\",VLOOKUP($AH54,'GPU001'!$B:$J,6,FALSE))","v":"MU"},{"$f":"IF($AI54,\"\",VLOOKUP($AH54,'GPU001'!$B:$J,7,FALSE))","v":222},null,{"$f":"CONCATENATE(\"4/7/\",$AE$12)","v":"4/7/1a"},{"$f":"(ISERROR(VLOOKUP($AH54,'GPU001'!$B:$J,5,FALSE)))","v":false},{"$f":"IF($AC54,\"\",VLOOKUP($AB54,'GPU001'!$A:$J,5,FALSE))","v":""},{"$f":"IF($AC54,\"\",VLOOKUP($AB54,'GPU001'!$A:$J,7,FALSE))","v":""},{"$f":"IF($AC54,\"\",VLOOKUP($AB54,'GPU001'!$A:$J,8,FALSE))","v":""},null,{"$f":"CONCATENATE(\"4/7/\",$AQ$12)","v":"4/7/10"},{"$f":"(ISERROR(VLOOKUP($AN54,'GPU001'!$C:$J,4,FALSE)))","v":false},{"$f":"IF($AO54,\"\",VLOOKUP($AN54,'GPU001'!$C:$J,4,FALSE))","v":"FUM"},{"$f":"IF($AO54,\"\",VLOOKUP($AN54,'GPU001'!$C:$J,3,FALSE))","v":"1B"},{"$f":"IF($AO54,\"\",VLOOKUP($AN54,'GPU001'!$C:$J,5,FALSE))","v":"IN"}]
[{"$f":"CONCATENATE(\"4/8/\",$G$3)","v":"4/8/"},{"$f":"(ISERROR(VLOOKUP($A55,'GPU001'!$A:$J,6,FALSE)))","v":true},null,"Do 8",{"$f":"IF($B55,\"\",VLOOKUP($A55,'GPU001'!$A:$J,5,FALSE))","v":""},{"$f":"IF($B55,\"\",VLOOKUP($A55,'GPU001'!$A:$J,6,FALSE))","v":""},{"$f":"IF($B55,\"\",VLOOKUP($A55,'GPU001'!$A:$J,7,FALSE))","v":""},{"$f":"IF($B55,\"\",VLOOKUP($A55,'GPU001'!$A:$J,8,FALSE))","v":""},null,null,null,null,null,null,null,null,null,null,null,null,null,null,null,null,null,"",null,{"$f":"CONCATENATE(\"4/8/\",$AK$12)","v":"4/8/arn"},{"$f":"(ISERROR(VLOOKUP($AB55,'GPU001'!$A:$J,6,FALSE)))","v":true},{"$f":"IF($AI55,\"\",VLOOKUP($AH55,'GPU001'!$B:$J,5,FALSE))","v":"BEL"},{"$f":"IF($AI55,\"\",VLOOKUP($AH55,'GPU001'!$B:$J,6,FALSE))","v":"MU"},{"$f":"IF($AI55,\"\",VLOOKUP($AH55,'GPU001'!$B:$J,7,FALSE))","v":222},null,{"$f":"CONCATENATE(\"4/8/\",$AE$12)","v":"4/8/1a"},{"$f":"(ISERROR(VLOOKUP($AH55,'GPU001'!$B:$J,5,FALSE)))","v":false},{"$f":"IF($AC55,\"\",VLOOKUP($AB55,'GPU001'!$A:$J,5,FALSE))","v":""},{"$f":"IF($AC55,\"\",VLOOKUP($AB55,'GPU001'!$A:$J,7,FALSE))","v":""},{"$f":"IF($AC55,\"\",VLOOKUP($AB55,'GPU001'!$A:$J,8,FALSE))","v":""},null,{"$f":"CONCATENATE(\"4/8/\",$AQ$12)","v":"4/8/10"},{"$f":"(ISERROR(VLOOKUP($AN55,'GPU001'!$C:$J,4,FALSE)))","v":false},{"$f":"IF($AO55,\"\",VLOOKUP($AN55,'GPU001'!$C:$J,4,FALSE))","v":"FUM"},{"$f":"IF($AO55,\"\",VLOOKUP($AN55,'GPU001'!$C:$J,3,FALSE))","v":"1C"},{"$f":"IF($AO55,\"\",VLOOKUP($AN55,'GPU001'!$C:$J,5,FALSE))","v":"IN"}]
[{"$f":"CONCATENATE(\"4/9/\",$G$3)","v":"4/9/"},{"$f":"(ISERROR(VLOOKUP($A56,'GPU001'!$A:$J,6,FALSE)))","v":true},null,"Do 9",{"$f":"IF($B56,\"\",VLOOKUP($A56,'GPU001'!$A:$J,5,FALSE))","v":""},{"$f":"IF($B56,\"\",VLOOKUP($A56,'GPU001'!$A:$J,6,FALSE))","v":""},{"$f":"IF($B56,\"\",VLOOKUP($A56,'GPU001'!$A:$J,7,FALSE))","v":""},{"$f":"IF($B56,\"\",VLOOKUP($A56,'GPU001'!$A:$J,8,FALSE))","v":""},null,null,null,null,null,null,null,null,null,null,null,null,null,null,null,null,null,"",null,{"$f":"CONCATENATE(\"4/9/\",$AK$12)","v":"4/9/arn"},{"$f":"(ISERROR(VLOOKUP($AB56,'GPU001'!$A:$J,6,FALSE)))","v":true},{"$f":"IF($AI56,\"\",VLOOKUP($AH56,'GPU001'!$B:$J,5,FALSE))","v":"KOR"},{"$f":"IF($AI56,\"\",VLOOKUP($AH56,'GPU001'!$B:$J,6,FALSE))","v":"DE"},{"$f":"IF($AI56,\"\",VLOOKUP($AH56,'GPU001'!$B:$J,7,FALSE))","v":213},null,{"$f":"CONCATENATE(\"4/9/\",$AE$12)","v":"4/9/1a"},{"$f":"(ISERROR(VLOOKUP($AH56,'GPU001'!$B:$J,5,FALSE)))","v":false},{"$f":"IF($AC56,\"\",VLOOKUP($AB56,'GPU001'!$A:$J,5,FALSE))","v":""},{"$f":"IF($AC56,\"\",VLOOKUP($AB56,'GPU001'!$A:$J,7,FALSE))","v":""},{"$f":"IF($AC56,\"\",VLOOKUP($AB56,'GPU001'!$A:$J,8,FALSE))","v":""},null,{"$f":"CONCATENATE(\"4/9/\",$AQ$12)","v":"4/9/10"},{"$f":"(ISERROR(VLOOKUP($AN56,'GPU001'!$C:$J,4,FALSE)))","v":false},{"$f":"IF($AO56,\"\",VLOOKUP($AN56,'GPU001'!$C:$J,4,FALSE))","v":"FUM"},{"$f":"IF($AO56,\"\",VLOOKUP($AN56,'GPU001'!$C:$J,3,FALSE))","v":"1D"},{"$f":"IF($AO56,\"\",VLOOKUP($AN56,'GPU001'!$C:$J,5,FALSE))","v":"IN"}]
[{"$f":"CONCATENATE(\"4/10/\",$G$3)","v":"4/10/"},{"$f":"(ISERROR(VLOOKUP($A57,'GPU001'!$A:$J,6,FALSE)))","v":true},null,"Do 10",{"$f":"IF($B57,\"\",VLOOKUP($A57,'GPU001'!$A:$J,5,FALSE))","v":""},{"$f":"IF($B57,\"\",VLOOKUP($A57,'GPU001'!$A:$J,6,FALSE))","v":""},{"$f":"IF($B57,\"\",VLOOKUP($A57,'GPU001'!$A:$J,7,FALSE))","v":""},{"$f":"IF($B57,\"\",VLOOKUP($A57,'GPU001'!$A:$J,8,FALSE))","v":""},null,null,null,null,null,null,null,null,null,null,null,null,null,null,null,null,null,"",null,{"$f":"CONCATENATE(\"4/10/\",$AK$12)","v":"4/10/arn"},{"$f":"(ISERROR(VLOOKUP($AB57,'GPU001'!$A:$J,6,FALSE)))","v":true},{"$f":"IF($AI57,\"\",VLOOKUP($AH57,'GPU001'!$B:$J,5,FALSE))","v":"FUM"},{"$f":"IF($AI57,\"\",VLOOKUP($AH57,'GPU001'!$B:$J,6,FALSE))","v":"IN"},{"$f":"IF($AI57,\"\",VLOOKUP($AH57,'GPU001'!$B:$J,7,FALSE))","v":10},null,{"$f":"CONCATENATE(\"4/10/\",$AE$12)","v":"4/10/1a"},{"$f":"(ISERROR(VLOOKUP($AH57,'GPU001'!$B:$J,5,FALSE)))","v":false},{"$f":"IF($AC57,\"\",VLOOKUP($AB57,'GPU001'!$A:$J,5,FALSE))","v":""},{"$f":"IF($AC57,\"\",VLOOKUP($AB57,'GPU001'!$A:$J,7,FALSE))","v":""},{"$f":"IF($AC57,\"\",VLOOKUP($AB57,'GPU001'!$A:$J,8,FALSE))","v":""},null,{"$f":"CONCATENATE(\"4/10/\",$AQ$12)","v":"4/10/10"},{"$f":"(ISERROR(VLOOKUP($AN57,'GPU001'!$C:$J,4,FALSE)))","v":false},{"$f":"IF($AO57,\"\",VLOOKUP($AN57,'GPU001'!$C:$J,4,FALSE))","v":"FUM"},{"$f":"IF($AO57,\"\",VLOOKUP($AN57,'GPU001'!$C:$J,3,FALSE))","v":"1A"},{"$f":"IF($AO57,\"\",VLOOKUP($AN57,'GPU001'!$C:$J,5,FALSE))","v":"IN"}]
[{"$f":"CONCATENATE(\"4/11/\",$G$3)","v":"4/11/"},{"$f":"(ISERROR(VLOOKUP($A58,'GPU001'!$A:$J,6,FALSE)))","v":true},null,"Do 11",{"$f":"IF($B58,\"\",VLOOKUP($A58,'GPU001'!$A:$J,5,FALSE))","v":""},{"$f":"IF($B58,\"\",VLOOKUP($A58,'GPU001'!$A:$J,6,FALSE))","v":""},{"$f":"IF($B58,\"\",VLOOKUP($A58,'GPU001'!$A:$J,7,FALSE))","v":""},{"$f":"IF($B58,\"\",VLOOKUP($A58,'GPU001'!$A:$J,8,FALSE))","v":""},null,null,null,null,null,null,null,null,null,null,null,null,null,null,null,null,null,"",null,{"$f":"CONCATENATE(\"4/11/\",$AK$12)","v":"4/11/arn"},{"$f":"(ISERROR(VLOOKUP($AB58,'GPU001'!$A:$J,6,FALSE)))","v":true},{"$f":"IF($AI58,\"\",VLOOKUP($AH58,'GPU001'!$B:$J,5,FALSE))","v":""},{"$f":"IF($AI58,\"\",VLOOKUP($AH58,'GPU001'!$B:$J,6,FALSE))","v":""},{"$f":"IF($AI58,\"\",VLOOKUP($AH58,'GPU001'!$B:$J,7,FALSE))","v":""},null,{"$f":"CONCATENATE(\"4/11/\",$AE$12)","v":"4/11/1a"},{"$f":"(ISERROR(VLOOKUP($AH58,'GPU001'!$B:$J,5,FALSE)))","v":true},{"$f":"IF($AC58,\"\",VLOOKUP($AB58,'GPU001'!$A:$J,5,FALSE))","v":""},{"$f":"IF($AC58,\"\",VLOOKUP($AB58,'GPU001'!$A:$J,7,FALSE))","v":""},{"$f":"IF($AC58,\"\",VLOOKUP($AB58,'GPU001'!$A:$J,8,FALSE))","v":""},null,{"$f":"CONCATENATE(\"4/11/\",$AQ$12)","v":"4/11/10"},{"$f":"(ISERROR(VLOOKUP($AN58,'GPU001'!$C:$J,4,FALSE)))","v":true},{"$f":"IF($AO58,\"\",VLOOKUP($AN58,'GPU001'!$C:$J,4,FALSE))","v":""},{"$f":"IF($AO58,\"\",VLOOKUP($AN58,'GPU001'!$C:$J,3,FALSE))","v":""},{"$f":"IF($AO58,\"\",VLOOKUP($AN58,'GPU001'!$C:$J,5,FALSE))","v":""}]
[{"$f":"CONCATENATE(\"5/1/\",$G$3)","v":"5/1/"},{"$f":"(ISERROR(VLOOKUP($A59,'GPU001'!$A:$J,6,FALSE)))","v":true},{"$f":"IF(ISTEXT(C48),\"\",C48+1)","v":""},"Fr 1",{"$f":"IF($B59,\"\",VLOOKUP($A59,'GPU001'!$A:$J,5,FALSE))","v":""},{"$f":"IF($B59,\"\",VLOOKUP($A59,'GPU001'!$A:$J,6,FALSE))","v":""},{"$f":"IF($B59,\"\",VLOOKUP($A59,'GPU001'!$A:$J,7,FALSE))","v":""},{"$f":"IF($B59,\"\",VLOOKUP($A59,'GPU001'!$A:$J,8,FALSE))","v":""},null,null,null,null,null,null,null,null,null,null,null,null,null,null,null,null,null,"",null,{"$f":"CONCATENATE(\"5/1/\",$AK$12)","v":"5/1/arn"},{"$f":"(ISERROR(VLOOKUP($AB59,'GPU001'!$A:$J,6,FALSE)))","v":false},{"$f":"IF($AI59,\"\",VLOOKUP($AH59,'GPU001'!$B:$J,5,FALSE))","v":"BUR"},{"$f":"IF($AI59,\"\",VLOOKUP($AH59,'GPU001'!$B:$J,6,FALSE))","v":"KS"},{"$f":"IF($AI59,\"\",VLOOKUP($AH59,'GPU001'!$B:$J,7,FALSE))","v":18},null,{"$f":"CONCATENATE(\"5/1/\",$AE$12)","v":"5/1/1a"},{"$f":"(ISERROR(VLOOKUP($AH59,'GPU001'!$B:$J,5,FALSE)))","v":false},{"$f":"IF($AC59,\"\",VLOOKUP($AB59,'GPU001'!$A:$J,5,FALSE))","v":"5E"},{"$f":"IF($AC59,\"\",VLOOKUP($AB59,'GPU001'!$A:$J,7,FALSE))","v":"KS"},{"$f":"IF($AC59,\"\",VLOOKUP($AB59,'GPU001'!$A:$J,8,FALSE))","v":213},null,{"$f":"CONCATENATE(\"5/1/\",$AQ$12)","v":"5/1/10"},{"$f":"(ISERROR(VLOOKUP($AN59,'GPU001'!$C:$J,4,FALSE)))","v":true},{"$f":"IF($AO59,\"\",VLOOKUP($AN59,'GPU001'!$C:$J,4,FALSE))","v":""},{"$f":"IF($AO59,\"\",VLOOKUP($AN59,'GPU001'!$C:$J,3,FALSE))","v":""},{"$f":"IF($AO59,\"\",VLOOKUP($AN59,'GPU001'!$C:$J,5,FALSE))","v":""}]
[{"$f":"CONCATENATE(\"5/2/\",$G$3)","v":"5/2/"},{"$f":"(ISERROR(VLOOKUP($A60,'GPU001'!$A:$J,6,FALSE)))","v":true},null,"Fr 2",{"$f":"IF($B60,\"\",VLOOKUP($A60,'GPU001'!$A:$J,5,FALSE))","v":""},{"$f":"IF($B60,\"\",VLOOKUP($A60,'GPU001'!$A:$J,6,FALSE))","v":""},{"$f":"IF($B60,\"\",VLOOKUP($A60,'GPU001'!$A:$J,7,FALSE))","v":""},{"$f":"IF($B60,\"\",VLOOKUP($A60,'GPU001'!$A:$J,8,FALSE))","v":""},null,null,null,null,null,null,null,null,null,null,null,null,null,null,null,null,null,"",null,{"$f":"CONCATENATE(\"5/2/\",$AK$12)","v":"5/2/arn"},{"$f":"(ISERROR(VLOOKUP($AB60,'GPU001'!$A:$J,6,FALSE)))","v":true},{"$f":"IF($AI60,\"\",VLOOKUP($AH60,'GPU001'!$B:$J,5,FALSE))","v":"BUR"},{"$f":"IF($AI60,\"\",VLOOKUP($AH60,'GPU001'!$B:$J,6,FALSE))","v":"EN"},{"$f":"IF($AI60,\"\",VLOOKUP($AH60,'GPU001'!$B:$J,7,FALSE))","v":18},null,{"$f":"CONCATENATE(\"5/2/\",$AE$12)","v":"5/2/1a"},{"$f":"(ISERROR(VLOOKUP($AH60,'GPU001'!$B:$J,5,FALSE)))","v":false},{"$f":"IF($AC60,\"\",VLOOKUP($AB60,'GPU001'!$A:$J,5,FALSE))","v":""},{"$f":"IF($AC60,\"\",VLOOKUP($AB60,'GPU001'!$A:$J,7,FALSE))","v":""},{"$f":"IF($AC60,\"\",VLOOKUP($AB60,'GPU001'!$A:$J,8,FALSE))","v":""},null,{"$f":"CONCATENATE(\"5/2/\",$AQ$12)","v":"5/2/10"},{"$f":"(ISERROR(VLOOKUP($AN60,'GPU001'!$C:$J,4,FALSE)))","v":true},{"$f":"IF($AO60,\"\",VLOOKUP($AN60,'GPU001'!$C:$J,4,FALSE))","v":""},{"$f":"IF($AO60,\"\",VLOOKUP($AN60,'GPU001'!$C:$J,3,FALSE))","v":""},{"$f":"IF($AO60,\"\",VLOOKUP($AN60,'GPU001'!$C:$J,5,FALSE))","v":""}]
[{"$f":"CONCATENATE(\"5/3/\",$G$3)","v":"5/3/"},{"$f":"(ISERROR(VLOOKUP($A61,'GPU001'!$A:$J,6,FALSE)))","v":true},null,"Fr 3",{"$f":"IF($B61,\"\",VLOOKUP($A61,'GPU001'!$A:$J,5,FALSE))","v":""},{"$f":"IF($B61,\"\",VLOOKUP($A61,'GPU001'!$A:$J,6,FALSE))","v":""},{"$f":"IF($B61,\"\",VLOOKUP($A61,'GPU001'!$A:$J,7,FALSE))","v":""},{"$f":"IF($B61,\"\",VLOOKUP($A61,'GPU001'!$A:$J,8,FALSE))","v":""},null,null,null,null,null,null,null,null,null,null,null,null,null,null,null,null,null,"",null,{"$f":"CONCATENATE(\"5/3/\",$AK$12)","v":"5/3/arn"},{"$f":"(ISERROR(VLOOKUP($AB61,'GPU001'!$A:$J,6,FALSE)))","v":false},{"$f":"IF($AI61,\"\",VLOOKUP($AH61,'GPU001'!$B:$J,5,FALSE))","v":"FUM"},{"$f":"IF($AI61,\"\",VLOOKUP($AH61,'GPU001'!$B:$J,6,FALSE))","v":"GS"},{"$f":"IF($AI61,\"\",VLOOKUP($AH61,'GPU001'!$B:$J,7,FALSE))","v":202},null,{"$f":"CONCATENATE(\"5/3/\",$AE$12)","v":"5/3/1a"},{"$f":"(ISERROR(VLOOKUP($AH61,'GPU001'!$B:$J,5,FALSE)))","v":false},{"$f":"IF($AC61,\"\",VLOOKUP($AB61,'GPU001'!$A:$J,5,FALSE))","v":"5E"},{"$f":"IF($AC61,\"\",VLOOKUP($AB61,'GPU001'!$A:$J,7,FALSE))","v":"DE"},{"$f":"IF($AC61,\"\",VLOOKUP($AB61,'GPU001'!$A:$J,8,FALSE))","v":213},null,{"$f":"CONCATENATE(\"5/3/\",$AQ$12)","v":"5/3/10"},{"$f":"(ISERROR(VLOOKUP($AN61,'GPU001'!$C:$J,4,FALSE)))","v":true},{"$f":"IF($AO61,\"\",VLOOKUP($AN61,'GPU001'!$C:$J,4,FALSE))","v":""},{"$f":"IF($AO61,\"\",VLOOKUP($AN61,'GPU001'!$C:$J,3,FALSE))","v":""},{"$f":"IF($AO61,\"\",VLOOKUP($AN61,'GPU001'!$C:$J,5,FALSE))","v":""}]
[{"$f":"CONCATENATE(\"5/4/\",$G$3)","v":"5/4/"},{"$f":"(ISERROR(VLOOKUP($A62,'GPU001'!$A:$J,6,FALSE)))","v":true},null,"Fr 4",{"$f":"IF($B62,\"\",VLOOKUP($A62,'GPU001'!$A:$J,5,FALSE))","v":""},{"$f":"IF($B62,\"\",VLOOKUP($A62,'GPU001'!$A:$J,6,FALSE))","v":""},{"$f":"IF($B62,\"\",VLOOKUP($A62,'GPU001'!$A:$J,7,FALSE))","v":""},{"$f":"IF($B62,\"\",VLOOKUP($A62,'GPU001'!$A:$J,8,FALSE))","v":""},null,null,null,null,null,null,null,null,null,null,null,null,null,null,null,null,null,"",null,{"$f":"CONCATENATE(\"5/4/\",$AK$12)","v":"5/4/arn"},{"$f":"(ISERROR(VLOOKUP($AB62,'GPU001'!$A:$J,6,FALSE)))","v":false},{"$f":"IF($AI62,\"\",VLOOKUP($AH62,'GPU001'!$B:$J,5,FALSE))","v":"FUM"},{"$f":"IF($AI62,\"\",VLOOKUP($AH62,'GPU001'!$B:$J,6,FALSE))","v":"GS"},{"$f":"IF($AI62,\"\",VLOOKUP($AH62,'GPU001'!$B:$J,7,FALSE))","v":202},null,{"$f":"CONCATENATE(\"5/4/\",$AE$12)","v":"5/4/1a"},{"$f":"(ISERROR(VLOOKUP($AH62,'GPU001'!$B:$J,5,FALSE)))","v":false},{"$f":"IF($AC62,\"\",VLOOKUP($AB62,'GPU001'!$A:$J,5,FALSE))","v":"5E"},{"$f":"IF($AC62,\"\",VLOOKUP($AB62,'GPU001'!$A:$J,7,FALSE))","v":"DE"},{"$f":"IF($AC62,\"\",VLOOKUP($AB62,'GPU001'!$A:$J,8,FALSE))","v":213},null,{"$f":"CONCATENATE(\"5/4/\",$AQ$12)","v":"5/4/10"},{"$f":"(ISERROR(VLOOKUP($AN62,'GPU001'!$C:$J,4,FALSE)))","v":true},{"$f":"IF($AO62,\"\",VLOOKUP($AN62,'GPU001'!$C:$J,4,FALSE))","v":""},{"$f":"IF($AO62,\"\",VLOOKUP($AN62,'GPU001'!$C:$J,3,FALSE))","v":""},{"$f":"IF($AO62,\"\",VLOOKUP($AN62,'GPU001'!$C:$J,5,FALSE))","v":""}]
[{"$f":"CONCATENATE(\"5/5/\",$G$3)","v":"5/5/"},{"$f":"(ISERROR(VLOOKUP($A63,'GPU001'!$A:$J,6,FALSE)))","v":true},null,"Fr 5",{"$f":"IF($B63,\"\",VLOOKUP($A63,'GPU001'!$A:$J,5,FALSE))","v":""},{"$f":"IF($B63,\"\",VLOOKUP($A63,'GPU001'!$A:$J,6,FALSE))","v":""},{"$f":"IF($B63,\"\",VLOOKUP($A63,'GPU001'!$A:$J,7,FALSE))","v":""},{"$f":"IF($B63,\"\",VLOOKUP($A63,'GPU001'!$A:$J,8,FALSE))","v":""},null,null,null,null,null,null,null,null,null,null,null,null,null,null,null,null,null,"",null,{"$f":"CONCATENATE(\"5/5/\",$AK$12)","v":"5/5/arn"},{"$f":"(ISERROR(VLOOKUP($AB63,'GPU001'!$A:$J,6,FALSE)))","v":true},{"$f":"IF($AI63,\"\",VLOOKUP($AH63,'GPU001'!$B:$J,5,FALSE))","v":""},{"$f":"IF($AI63,\"\",VLOOKUP($AH63,'GPU001'!$B:$J,6,FALSE))","v":""},{"$f":"IF($AI63,\"\",VLOOKUP($AH63,'GPU001'!$B:$J,7,FALSE))","v":""},null,{"$f":"CONCATENATE(\"5/5/\",$AE$12)","v":"5/5/1a"},{"$f":"(ISERROR(VLOOKUP($AH63,'GPU001'!$B:$J,5,FALSE)))","v":true},{"$f":"IF($AC63,\"\",VLOOKUP($AB63,'GPU001'!$A:$J,5,FALSE))","v":""},{"$f":"IF($AC63,\"\",VLOOKUP($AB63,'GPU001'!$A:$J,7,FALSE))","v":""},{"$f":"IF($AC63,\"\",VLOOKUP($AB63,'GPU001'!$A:$J,8,FALSE))","v":""},null,{"$f":"CONCATENATE(\"5/5/\",$AQ$12)","v":"5/5/10"},{"$f":"(ISERROR(VLOOKUP($AN63,'GPU001'!$C:$J,4,FALSE)))","v":true},{"$f":"IF($AO63,\"\",VLOOKUP($AN63,'GPU001'!$C:$J,4,FALSE))","v":""},{"$f":"IF($AO63,\"\",VLOOKUP($AN63,'GPU001'!$C:$J,3,FALSE))","v":""},{"$f":"IF($AO63,\"\",VLOOKUP($AN63,'GPU001'!$C:$J,5,FALSE))","v":""}]
[{"$f":"CONCATENATE(\"5/6/\",$G$3)","v":"5/6/"},{"$f":"(ISERROR(VLOOKUP($A64,'GPU001'!$A:$J,6,FALSE)))","v":true},null,"Fr 6",{"$f":"IF($B64,\"\",VLOOKUP($A64,'GPU001'!$A:$J,5,FALSE))","v":""},{"$f":"IF($B64,\"\",VLOOKUP($A64,'GPU001'!$A:$J,6,FALSE))","v":""},{"$f":"IF($B64,\"\",VLOOKUP($A64,'GPU001'!$A:$J,7,FALSE))","v":""},{"$f":"IF($B64,\"\",VLOOKUP($A64,'GPU001'!$A:$J,8,FALSE))","v":""},null,null,null,null,null,null,null,null,null,null,null,null,null,null,null,null,null,"",null,{"$f":"CONCATENATE(\"5/6/\",$AK$12)","v":"5/6/arn"},{"$f":"(ISERROR(VLOOKUP($AB64,'GPU001'!$A:$J,6,FALSE)))","v":true},{"$f":"IF($AI64,\"\",VLOOKUP($AH64,'GPU001'!$B:$J,5,FALSE))","v":""},{"$f":"IF($AI64,\"\",VLOOKUP($AH64,'GPU001'!$B:$J,6,FALSE))","v":""},{"$f":"IF($AI64,\"\",VLOOKUP($AH64,'GPU001'!$B:$J,7,FALSE))","v":""},null,{"$f":"CONCATENATE(\"5/6/\",$AE$12)","v":"5/6/1a"},{"$f":"(ISERROR(VLOOKUP($AH64,'GPU001'!$B:$J,5,FALSE)))","v":true},{"$f":"IF($AC64,\"\",VLOOKUP($AB64,'GPU001'!$A:$J,5,FALSE))","v":""},{"$f":"IF($AC64,\"\",VLOOKUP($AB64,'GPU001'!$A:$J,7,FALSE))","v":""},{"$f":"IF($AC64,\"\",VLOOKUP($AB64,'GPU001'!$A:$J,8,FALSE))","v":""},null,{"$f":"CONCATENATE(\"5/6/\",$AQ$12)","v":"5/6/10"},{"$f":"(ISERROR(VLOOKUP($AN64,'GPU001'!$C:$J,4,FALSE)))","v":true},{"$f":"IF($AO64,\"\",VLOOKUP($AN64,'GPU001'!$C:$J,4,FALSE))","v":""},{"$f":"IF($AO64,\"\",VLOOKUP($AN64,'GPU001'!$C:$J,3,FALSE))","v":""},{"$f":"IF($AO64,\"\",VLOOKUP($AN64,'GPU001'!$C:$J,5,FALSE))","v":""}]
[{"$f":"CONCATENATE(\"5/7/\",$G$3)","v":"5/7/"},{"$f":"(ISERROR(VLOOKUP($A65,'GPU001'!$A:$J,6,FALSE)))","v":true},null,"Fr 7",{"$f":"IF($B65,\"\",VLOOKUP($A65,'GPU001'!$A:$J,5,FALSE))","v":""},{"$f":"IF($B65,\"\",VLOOKUP($A65,'GPU001'!$A:$J,6,FALSE))","v":""},{"$f":"IF($B65,\"\",VLOOKUP($A65,'GPU001'!$A:$J,7,FALSE))","v":""},{"$f":"IF($B65,\"\",VLOOKUP($A65,'GPU001'!$A:$J,8,FALSE))","v":""},null,null,null,null,null,null,null,null,null,null,null,null,null,null,null,null,null,"",null,{"$f":"CONCATENATE(\"5/7/\",$AK$12)","v":"5/7/arn"},{"$f":"(ISERROR(VLOOKUP($AB65,'GPU001'!$A:$J,6,FALSE)))","v":false},{"$f":"IF($AI65,\"\",VLOOKUP($AH65,'GPU001'!$B:$J,5,FALSE))","v":"BRO"},{"$f":"IF($AI65,\"\",VLOOKUP($AH65,'GPU001'!$B:$J,6,FALSE))","v":"BG"},{"$f":"IF($AI65,\"\",VLOOKUP($AH65,'GPU001'!$B:$J,7,FALSE))","v":"U47"},null,{"$f":"CONCATENATE(\"5/7/\",$AE$12)","v":"5/7/1a"},{"$f":"(ISERROR(VLOOKUP($AH65,'GPU001'!$B:$J,5,FALSE)))","v":false},{"$f":"IF($AC65,\"\",VLOOKUP($AB65,'GPU001'!$A:$J,5,FALSE))","v":"4C"},{"$f":"IF($AC65,\"\",VLOOKUP($AB65,'GPU001'!$A:$J,7,FALSE))","v":"DE"},{"$f":"IF($AC65,\"\",VLOOKUP($AB65,'GPU001'!$A:$J,8,FALSE))","v":213},null,{"$f":"CONCATENATE(\"5/7/\",$AQ$12)","v":"5/7/10"},{"$f":"(ISERROR(VLOOKUP($AN65,'GPU001'!$C:$J,4,FALSE)))","v":false},{"$f":"IF($AO65,\"\",VLOOKUP($AN65,'GPU001'!$C:$J,4,FALSE))","v":"GHE"},{"$f":"IF($AO65,\"\",VLOOKUP($AN65,'GPU001'!$C:$J,3,FALSE))","v":"2B"},{"$f":"IF($AO65,\"\",VLOOKUP($AN65,'GPU001'!$C:$J,5,FALSE))","v":"IN"}]
[{"$f":"CONCATENATE(\"5/8/\",$G$3)","v":"5/8/"},{"$f":"(ISERROR(VLOOKUP($A66,'GPU001'!$A:$J,6,FALSE)))","v":true},null,"Fr 8",{"$f":"IF($B66,\"\",VLOOKUP($A66,'GPU001'!$A:$J,5,FALSE))","v":""},{"$f":"IF($B66,\"\",VLOOKUP($A66,'GPU001'!$A:$J,6,FALSE))","v":""},{"$f":"IF($B66,\"\",VLOOKUP($A66,'GPU001'!$A:$J,7,FALSE))","v":""},{"$f":"IF($B66,\"\",VLOOKUP($A66,'GPU001'!$A:$J,8,FALSE))","v":""},null,null,null,null,null,null,null,null,null,null,null,null,null,null,null,null,null,"",null,{"$f":"CONCATENATE(\"5/8/\",$AK$12)","v":"5/8/arn"},{"$f":"(ISERROR(VLOOKUP($AB66,'GPU001'!$A:$J,6,FALSE)))","v":false},{"$f":"IF($AI66,\"\",VLOOKUP($AH66,'GPU001'!$B:$J,5,FALSE))","v":"BRO"},{"$f":"IF($AI66,\"\",VLOOKUP($AH66,'GPU001'!$B:$J,6,FALSE))","v":"BG"},{"$f":"IF($AI66,\"\",VLOOKUP($AH66,'GPU001'!$B:$J,7,FALSE))","v":"U47"},null,{"$f":"CONCATENATE(\"5/8/\",$AE$12)","v":"5/8/1a"},{"$f":"(ISERROR(VLOOKUP($AH66,'GPU001'!$B:$J,5,FALSE)))","v":false},{"$f":"IF($AC66,\"\",VLOOKUP($AB66,'GPU001'!$A:$J,5,FALSE))","v":"4C"},{"$f":"IF($AC66,\"\",VLOOKUP($AB66,'GPU001'!$A:$J,7,FALSE))","v":"DE"},{"$f":"IF($AC66,\"\",VLOOKUP($AB66,'GPU001'!$A:$J,8,FALSE))","v":213},null,{"$f":"CONCATENATE(\"5/8/\",$AQ$12)","v":"5/8/10"},{"$f":"(ISERROR(VLOOKUP($AN66,'GPU001'!$C:$J,4,FALSE)))","v":false},{"$f":"IF($AO66,\"\",VLOOKUP($AN66,'GPU001'!$C:$J,4,FALSE))","v":"GHE"},{"$f":"IF($AO66,\"\",VLOOKUP($AN66,'GPU001'!$C:$J,3,FALSE))","v":"2B"},{"$f":"IF($AO66,\"\",VLOOKUP($AN66,'GPU001'!$C:$J,5,FALSE))","v":"IN"}]
[{"$f":"CONCATENATE(\"5/9/\",$G$3)","v":"5/9/"},{"$f":"(ISERROR(VLOOKUP($A67,'GPU001'!$A:$J,6,FALSE)))","v":true},null,"Fr 9",{"$f":"IF($B67,\"\",VLOOKUP($A67,'GPU001'!$A:$J,5,FALSE))","v":""},{"$f":"IF($B67,\"\",VLOOKUP($A67,'GPU001'!$A:$J,6,FALSE))","v":""},{"$f":"IF($B67,\"\",VLOOKUP($A67,'GPU001'!$A:$J,7,FALSE))","v":""},{"$f":"IF($B67,\"\",VLOOKUP($A67,'GPU001'!$A:$J,8,FALSE))","v":""},null,null,null,null,null,null,null,null,null,null,null,null,null,null,null,null,null,"",null,{"$f":"CONCATENATE(\"5/9/\",$AK$12)","v":"5/9/arn"},{"$f":"(ISERROR(VLOOKUP($AB67,'GPU001'!$A:$J,6,FALSE)))","v":true},{"$f":"IF($AI67,\"\",VLOOKUP($AH67,'GPU001'!$B:$J,5,FALSE))","v":"CON"},{"$f":"IF($AI67,\"\",VLOOKUP($AH67,'GPU001'!$B:$J,6,FALSE))","v":"MA"},{"$f":"IF($AI67,\"\",VLOOKUP($AH67,'GPU001'!$B:$J,7,FALSE))","v":112},null,{"$f":"CONCATENATE(\"5/9/\",$AE$12)","v":"5/9/1a"},{"$f":"(ISERROR(VLOOKUP($AH67,'GPU001'!$B:$J,5,FALSE)))","v":false},{"$f":"IF($AC67,\"\",VLOOKUP($AB67,'GPU001'!$A:$J,5,FALSE))","v":""},{"$f":"IF($AC67,\"\",VLOOKUP($AB67,'GPU001'!$A:$J,7,FALSE))","v":""},{"$f":"IF($AC67,\"\",VLOOKUP($AB67,'GPU001'!$A:$J,8,FALSE))","v":""},null,{"$f":"CONCATENATE(\"5/9/\",$AQ$12)","v":"5/9/10"},{"$f":"(ISERROR(VLOOKUP($AN67,'GPU001'!$C:$J,4,FALSE)))","v":true},{"$f":"IF($AO67,\"\",VLOOKUP($AN67,'GPU001'!$C:$J,4,FALSE))","v":""},{"$f":"IF($AO67,\"\",VLOOKUP($AN67,'GPU001'!$C:$J,3,FALSE))","v":""},{"$f":"IF($AO67,\"\",VLOOKUP($AN67,'GPU001'!$C:$J,5,FALSE))","v":""}]
[{"$f":"CONCATENATE(\"5/10/\",$G$3)","v":"5/10/"},{"$f":"(ISERROR(VLOOKUP($A68,'GPU001'!$A:$J,6,FALSE)))","v":true},null,"Fr 10",{"$f":"IF($B68,\"\",VLOOKUP($A68,'GPU001'!$A:$J,5,FALSE))","v":""},{"$f":"IF($B68,\"\",VLOOKUP($A68,'GPU001'!$A:$J,6,FALSE))","v":""},{"$f":"IF($B68,\"\",VLOOKUP($A68,'GPU001'!$A:$J,7,FALSE))","v":""},{"$f":"IF($B68,\"\",VLOOKUP($A68,'GPU001'!$A:$J,8,FALSE))","v":""},null,null,null,null,null,null,null,null,null,null,null,null,null,null,null,null,null,"",null,{"$f":"CONCATENATE(\"5/10/\",$AK$12)","v":"5/10/arn"},{"$f":"(ISERROR(VLOOKUP($AB68,'GPU001'!$A:$J,6,FALSE)))","v":true},{"$f":"IF($AI68,\"\",VLOOKUP($AH68,'GPU001'!$B:$J,5,FALSE))","v":"BLA"},{"$f":"IF($AI68,\"\",VLOOKUP($AH68,'GPU001'!$B:$J,6,FALSE))","v":"SD"},{"$f":"IF($AI68,\"\",VLOOKUP($AH68,'GPU001'!$B:$J,7,FALSE))","v":"THU"},null,{"$f":"CONCATENATE(\"5/10/\",$AE$12)","v":"5/10/1a"},{"$f":"(ISERROR(VLOOKUP($AH68,'GPU001'!$B:$J,5,FALSE)))","v":false},{"$f":"IF($AC68,\"\",VLOOKUP($AB68,'GPU001'!$A:$J,5,FALSE))","v":""},{"$f":"IF($AC68,\"\",VLOOKUP($AB68,'GPU001'!$A:$J,7,FALSE))","v":""},{"$f":"IF($AC68,\"\",VLOOKUP($AB68,'GPU001'!$A:$J,8,FALSE))","v":""},null,{"$f":"CONCATENATE(\"5/10/\",$AQ$12)","v":"5/10/10"},{"$f":"(ISERROR(VLOOKUP($AN68,'GPU001'!$C:$J,4,FALSE)))","v":true},{"$f":"IF($AO68,\"\",VLOOKUP($AN68,'GPU001'!$C:$J,4,FALSE))","v":""},{"$f":"IF($AO68,\"\",VLOOKUP($AN68,'GPU001'!$C:$J,3,FALSE))","v":""},{"$f":"IF($AO68,\"\",VLOOKUP($AN68,'GPU001'!$C:$J,5,FALSE))","v":""}]
[{"$f":"CONCATENATE(\"5/11/\",$G$3)","v":"5/11/"},{"$f":"(ISERROR(VLOOKUP($A69,'GPU001'!$A:$J,6,FALSE)))","v":true},null,"Fr 11",{"$f":"IF($B69,\"\",VLOOKUP($A69,'GPU001'!$A:$J,5,FALSE))","v":""},{"$f":"IF($B69,\"\",VLOOKUP($A69,'GPU001'!$A:$J,6,FALSE))","v":""},{"$f":"IF($B69,\"\",VLOOKUP($A69,'GPU001'!$A:$J,7,FALSE))","v":""},{"$f":"IF($B69,\"\",VLOOKUP($A69,'GPU001'!$A:$J,8,FALSE))","v":""},null,null,null,null,null,null,null,null,null,null,null,null,null,null,null,null,null,"",null,{"$f":"CONCATENATE(\"5/11/\",$AK$12)","v":"5/11/arn"},{"$f":"(ISERROR(VLOOKUP($AB69,'GPU001'!$A:$J,6,FALSE)))","v":true},{"$f":"IF($AI69,\"\",VLOOKUP($AH69,'GPU001'!$B:$J,5,FALSE))","v":""},{"$f":"IF($AI69,\"\",VLOOKUP($AH69,'GPU001'!$B:$J,6,FALSE))","v":""},{"$f":"IF($AI69,\"\",VLOOKUP($AH69,'GPU001'!$B:$J,7,FALSE))","v":""},null,{"$f":"CONCATENATE(\"5/11/\",$AE$12)","v":"5/11/1a"},{"$f":"(ISERROR(VLOOKUP($AH69,'GPU001'!$B:$J,5,FALSE)))","v":true},{"$f":"IF($AC69,\"\",VLOOKUP($AB69,'GPU001'!$A:$J,5,FALSE))","v":""},{"$f":"IF($AC69,\"\",VLOOKUP($AB69,'GPU001'!$A:$J,7,FALSE))","v":""},{"$f":"IF($AC69,\"\",VLOOKUP($AB69,'GPU001'!$A:$J,8,FALSE))","v":""},null,{"$f":"CONCATENATE(\"5/11/\",$AQ$12)","v":"5/11/10"},{"$f":"(ISERROR(VLOOKUP($AN69,'GPU001'!$C:$J,4,FALSE)))","v":true},{"$f":"IF($AO69,\"\",VLOOKUP($AN69,'GPU001'!$C:$J,4,FALSE))","v":""},{"$f":"IF($AO69,\"\",VLOOKUP($AN69,'GPU001'!$C:$J,3,FALSE))","v":""},{"$f":"IF($AO69,\"\",VLOOKUP($AN69,'GPU001'!$C:$J,5,FALSE))","v":""}]
[]
[null,null,"Datum",null,null,null,null,null,null,null,null,null,"Unterschrift"]
[]
[null,null,"Formular Urlaubsgesuch und Vertretungsplanung spätestens am Montag der Vorwoche"]
[null,null,"der ersten Absenz in das Fach des Sekretariats"]

{"sheet":"GPU001","index":2,"n_rows":2268,"n_cols":10,"rows_kept":2268,"cut":false,"hidden":true,"merged":[]}
[{"$f":"CONCATENATE($I1,\"/\",$J1,\"/\",$F1)","v":"2/7/STA"},{"$f":"CONCATENATE($I1,\"/\",$J1,\"/\",$E1)","v":"2/7/6A"},{"$f":"CONCATENATE($I1,\"/\",$J1,\"/\",$H1)","v":"2/7/N16"},2354,"6A","STA","EBI","N16",2,7]
["2/8/STA","2/8/6A","2/8/N16",2354,"6A","STA","EBI","N16",2,8]
["2/7/STA","2/7/6B","2/7/N16",2354,"6B","STA","EBI","N16",2,7]
["2/8/STA","2/8/6B","2/8/N16",2354,"6B","STA","EBI","N16",2,8]
["2/7/STA","2/7/6C","2/7/N16",2354,"6C","STA","EBI","N16",2,7]
["2/8/STA","2/8/6C","2/8/N16",2354,"6C","STA","EBI","N16",2,8]
["2/7/STA","2/7/6D","2/7/N16",2354,"6D","STA","EBI","N16",2,7]
["2/8/STA","2/8/6D","2/8/N16",2354,"6D","STA","EBI","N16",2,8]
["2/7/STA","2/7/6K","2/7/N16",2354,"6K","STA","EBI","N16",2,7]
["2/8/STA","2/8/6K","2/8/N16",2354,"6K","STA","EBI","N16",2,8]
["2/7/STA","2/7/6L","2/7/N16",2354,"6L","STA","EBI","N16",2,7]
["2/8/STA","2/8/6L","2/8/N16",2354,"6L","STA","EBI","N16",2,8]
["2/7/DIS","2/7/6A","2/7/106",2354,"6A","DIS","EGG",106,2,7]
["2/8/DIS","2/8/6A","2/8/106",2354,"6A","DIS","EGG",106,2,8]
["2/7/DIS","2/7/6B","2/7/106",2354,"6B","DIS","EGG",106,2,7]
["2/8/DIS","2/8/6B","2/8/106",2354,"6B","DIS","EGG",106,2,8]
["2/7/DIS","2/7/6C","2/7/106",2354,"6C","DIS","EGG",106,2,7]
["2/8/DIS","2/8/6C","2/8/106",2354,"6C","DIS","EGG",106,2,8]
["2/7/DIS","2/7/6D","2/7/106",2354,"6D","DIS","EGG",106,2,7]
["2/8/DIS","2/8/6D","2/8/106",2354,"6D","DIS","EGG",106,2,8]
["2/7/DIS","2/7/6K","2/7/106",2354,"6K","DIS","EGG",106,2,7]
["2/8/DIS","2/8/6K","2/8/106",2354,"6K","DIS","EGG",106,2,8]
["2/7/DIS","2/7/6L","2/7/106",2354,"6L","DIS","EGG",106,2,7]
["2/8/DIS","2/8/6L","2/8/106",2354,"6L","DIS","EGG",106,2,8]
["2/7/KNE","2/7/6A","2/7/115",2354,"6A","KNE","EGG",115,2,7]
["2/8/KNE","2/8/6A","2/8/115",2354,"6A","KNE","EGG",115,2,8]
["2/7/KNE","2/7/6B","2/7/115",2354,"6B","KNE","EGG",115,2,7]
["2/8/KNE","2/8/6B","2/8/115",2354,"6B","KNE","EGG",115,2,8]
["2/7/KNE","2/7/6C","2/7/115",2354,"6C","KNE","EGG",115,2,7]
["2/8/KNE","2/8/6C","2/8/115",2354,"6C","KNE","EGG",115,2,8]
["2/7/KNE","2/7/6D","2/7/115",2354,"6D","KNE","EGG",115,2,7]
["2/8/KNE","2/8/6D","2/8/115",2354,"6D","KNE","EGG",115,2,8]
["2/7/KNE","2/7/6K","2/7/115",2354,"6K","KNE","EGG",115,2,7]
["2/8/KNE","2/8/6K","2/8/115",2354,"6K","KNE","EGG",115,2,8]
["2/7/KNE","2/7/6L","2/7/115",2354,"6L","KNE","EGG",115,2,7]
["2/8/KNE","2/8/6L","2/8/115",2354,"6L","KNE","EGG",115,2,8]
["2/7/FAN","2/7/6A","2/7/E53",2354,"6A","FAN","EPP","E53",2,7]
["2/8/FAN","2/8/6A","2/8/E53",2354,"6A","FAN","EPP","E53",2,8]
[{"$f":"CONCATENATE($I39,\"/\",$J39,\"/\",$F39)","v":"2/7/FAN"},{"$f":"CONCATENATE($I39,\"/\",$J39,\"/\",$E39)","v":"2/7/6B"},{"$f":"CONCATENATE($I39,\"/\",$J39,\"/\",$H39)","v":"2/7/E53"},2354,"6B","FAN","EPP","E53",2,7]
["2/8/FAN","2/8/6B","2/8/E53",2354,"6B","FAN","EPP","E53",2,8]
["2/7/FAN","2/7/6C","2/7/E53",2354,"6C","FAN","EPP","E53",2,7]
["2/8/FAN","2/8/6C","2/8/E53",2354,"6C","FAN","EPP","E53",2,8]
["2/7/FAN","2/7/6D","2/7/E53",2354,"6D","FAN","EPP","E53",2,7]
["2/8/FAN","2/8/6D","2/8/E53",2354,"6D","FAN","EPP","E53",2,8]
["2/7/FAN","2/7/6K","2/7/E53",2354,"6K","FAN","EPP","E53",2,7]
["2/8/FAN","2/8/6K","2/8/E53",2354,"6K","FAN","EPP","E53",2,8]
["2/7/FAN","2/7/6L","2/7/E53",2354,"6L","FAN","EPP","E53",2,7]
["2/8/FAN","2/8/6L","2/8/E53",2354,"6L","FAN","EPP","E53",2,8]
["2/7/MAU","2/7/6A","2/7/245",2354,"6A","MAU","EPP",245,2,7]
["2/8/MAU","2/8/6A","2/8/245",2354,"6A","MAU","EPP",245,2,8]
["2/7/MAU","2/7/6B","2/7/245",2354,"6B","MAU","EPP",245,2,7]
["2/8/MAU","2/8/6B","2/8/245",2354,"6B","MAU","EPP",245,2,8]
["2/7/MAU","2/7/6C","2/7/245",2354,"6C","MAU","EPP",245,2,7]
["2/8/MAU","2/8/6C","2/8/245",2354,"6C","MAU","EPP",245,2,8]
["2/7/MAU","2/7/6D","2/7/245",2354,"6D","MAU","EPP",245,2,7]
["2/8/MAU","2/8/6D","2/8/245",2354,"6D","MAU","EPP",245,2,8]
["2/7/MAU","2/7/6K","2/7/245",2354,"6K","MAU","EPP",245,2,7]
["2/8/MAU","2/8/6K","2/8/245",2354,"6K","MAU","EPP",245,2,8]
["2/7/MAU","2/7/6L","2/7/245",2354,"6L","MAU","EPP",245,2,7]
["2/8/MAU","2/8/6L","2/8/245",2354,"6L","MAU","EPP",245,2,8]
["2/7/BLA","2/7/6A","2/7/~THO~E51",2354,"6A","BLA","ESP","~THO~E51",2,7]
["2/8/BLA","2/8/6A","2/8/~THO~E51",2354,"6A","BLA","ESP","~THO~E51",2,8]
["2/7/BLA","2/7/6B","2/7/~THO~E51",2354,"6B","BLA","ESP","~THO~E51",2,7]
["2/8/BLA","2/8/6B","2/8/~THO~E51",2354,"6B","BLA","ESP","~THO~E51",2,8]
["2/7/BLA","2/7/6C","2/7/~THO~E51",2354,"6C","BLA","ESP","~THO~E51",2,7]
["2/8/BLA","2/8/6C","2/8/~THO~E51",2354,"6C","BLA","ESP","~THO~E51",2,8]
["2/7/BLA","2/7/6D","2/7/~THO~E51",2354,"6D","BLA","ESP","~THO~E51",2,7]
["2/8/BLA","2/8/6D","2/8/~THO~E51",2354,"6D","BLA","ESP","~THO~E51",2,8]
["2/7/BLA","2/7/6K","2/7/~THO~E51",2354,"6K","BLA","ESP","~THO~E51",2,7]
["2/8/BLA","2/8/6K","2/8/~THO~E51",2354,"6K","BLA","ESP","~THO~E51",2,8]
["2/7/BLA","2/7/6L","2/7/~THO~E51",2354,"6L","BLA","ESP","~THO~E51",2,7]
["2/8/BLA","2/8/6L","2/8/~THO~E51",2354,"6L","BLA","ESP","~THO~E51",2,8]
["1/7/GRM","1/7/3A","1/7/TE2",43348,"3A","GRM","SH","TE2",1,7]
["1/8/GRM","1/8/3A","1/8/TE2",43348,"3A","GRM","SH","TE2",1,8]
["1/7/GRM","1/7/3B","1/7/TE2",43348,"3B","GRM","SH","TE2",1,7]
["1/8/GRM","1/8/3B","1/8/TE2",43348,"3B","GRM","SH","TE2",1,8]
["1/7/WEY","1/7/3A","1/7/THU",43348,"3A","WEY","SD","THU",1,7]
["1/8/WEY","1/8/3A","1/8/THU",43348,"3A","WEY","SD","THU",1,8]
["1/7/WEY","1/7/3B","1/7/THU",43348,"3B","WEY","SD","THU",1,7]
["1/8/WEY","1/8/3B","1/8/THU",43348,"3B","WEY","SD","THU",1,8]
["3/4/GRM","3/4/3A","3/4/THU",921,"3A","GRM","SH","THU",3,4]
["3/4/GRM","3/4/3B","3/4/THU",921,"3B","GRM","SH","THU",3,4]
["3/4/WEY","3/4/3A","3/4/THO",921,"3A","WEY","SD","THO",3,4]
["3/4/WEY","3/4/3B","3/4/THO",921,"3B","WEY","SD","THO",3,4]
["3/3/SPE","3/3/6A","3/3/E51",43408,"6A","SPE","SIT","E51",3,3]
["3/4/SPE","3/4/6A","3/4/E51",43408,"6A","SPE","SIT","E51",3,4]
["3/3/SPE","3/3/6K","3/3/E51",43408,"6K","SPE","SIT","E51",3,3]
["3/4/SPE","3/4/6K","3/4/E51",43408,"6K","SPE","SIT","E51",3,4]
["3/3/SPE","3/3/6L","3/3/E51",43408,"6L","SPE","SIT","E51",3,3]
["3/4/SPE","3/4/6L","3/4/E51",43408,"6L","SPE","SIT","E51",3,4]
["3/3/ISE","3/3/6K","3/3/N02",43408,"6K","ISE","SBC","N02",3,3]
["3/4/ISE","3/4/6K","3/4/N02",43408,"6K","ISE","SBC","N02",3,4]
["3/3/ISE","3/3/6L","3/3/N02",43408,"6L","ISE","SBC","N02",3,3]
["3/4/ISE","3/4/6L","3/4/N02",43408,"6L","ISE","SBC","N02",3,4]
["3/3/ISE","3/3/6B","3/3/N02",43408,"6B","ISE","SBC","N02",3,3]
["3/4/ISE","3/4/6B","3/4/N02",43408,"6B","ISE","SBC","N02",3,4]
["3/3/ISE","3/3/6D","3/3/N02",43408,"6D","ISE","SBC","N02",3,3]
["3/4/ISE","3/4/6D","3/4/N02",43408,"6D","ISE","SBC","N02",3,4]
["3/3/HAN","3/3/6K","3/3/~N15~N17",43408,"6K","HAN","SBC","~N15~N17",3,3]
["3/4/HAN","3/4/6K","3/4/~N15~N17",43408,"6K","HAN","SBC","~N15~N17",3,4]
["3/3/HAN","3/3/6L","3/3/~N15~N17",43408,"6L","HAN","SBC","~N15~N17",3,3]
["3/4/HAN","3/4/6L","3/4/~N15~N17",43408,"6L","HAN","SBC","~N15~N17",3,4]
[{"$f":"CONCATENATE($I103,\"/\",$J103,\"/\",$F103)","v":"3/3/HAN"},{"$f":"CONCATENATE($I103,\"/\",$J103,\"/\",$E103)","v":"3/3/6B"},{"$f":"CONCATENATE($I103,\"/\",$J103,\"/\",$H103)","v":"3/3/~N15~N17"},43408,"6B","HAN","SBC","~N15~N17",3,3]
["3/4/HAN","3/4/6B","3/4/~N15~N17",43408,"6B","HAN","SBC","~N15~N17",3,4]
["3/3/HAN","3/3/6D","3/3/~N15~N17",43408,"6D","HAN","SBC","~N15~N17",3,3]
["3/4/HAN","3/4/6D","3/4/~N15~N17",43408,"6D","HAN","SBC","~N15~N17",3,4]
["3/3/HUJ","3/3/6K","3/3/122",43408,"6K","HUJ","SBG",122,3,3]
["3/4/HUJ","3/4/6K","3/4/122",43408,"6K","HUJ","SBG",122,3,4]
["3/3/HUJ","3/3/6C","3/3/122",43408,"6C","HUJ","SBG",122,3,3]
["3/4/HUJ","3/4/6C","3/4/122",43408,"6C","HUJ","SBG",122,3,4]
["3/3/GUH","3/3/6K","3/3/118",43408,"6K","GUH","SPM",118,3,3]
["3/4/GUH","3/4/6K","3/4/118",43408,"6K","GUH","SPM",118,3,4]
["3/3/GUH","3/3/6L","3/3/118",43408,"6L","GUH","SPM",118,3,3]
["3/4/GUH","3/4/6L","3/4/118",43408,"6L","GUH","SPM",118,3,4]
["3/3/GUH","3/3/6B","3/3/118",43408,"6B","GUH","SPM",118,3,3]
["3/4/GUH","3/4/6B","3/4/118",43408,"6B","GUH","SPM",118,3,4]
["3/3/GUH","3/3/6D","3/3/118",43408,"6D","GUH","SPM",118,3,3]
["3/4/GUH","3/4/6D","3/4/118",43408,"6D","GUH","SPM",118,3,4]
["3/3/UNT","3/3/6K","3/3/222",43408,"6K","UNT","SMU",222,3,3]
["3/4/UNT","3/4/6K","3/4/222",43408,"6K","UNT","SMU",222,3,4]
["3/3/UNT","3/3/6D","3/3/222",43408,"6D","UNT","SMU",222,3,3]
["3/4/UNT","3/4/6D","3/4/222",43408,"6D","UNT","SMU",222,3,4]
["3/3/GER","3/3/6D","3/3/208",43408,"6D","GER","SWR",208,3,3]
["3/4/GER","3/4/6D","3/4/208",43408,"6D","GER","SWR",208,3,4]
["3/3/KUT","3/3/6C","3/3/210",43408,"6C","KUT","SWR",210,3,3]
["3/4/KUT","3/4/6C","3/4/210",43408,"6C","KUT","SWR",210,3,4]
["5/7/SPE","5/7/6A","5/7/E51",43410,"6A","SPE","SIT","E51",5,7]
["5/8/SPE","5/8/6A","5/8/E51",43410,"6A","SPE","SIT","E51",5,8]
["5/7/SPE","5/7/6K","5/7/E51",43410,"6K","SPE","SIT","E51",5,7]
["5/8/SPE","5/8/6K","5/8/E51",43410,"6K","SPE","SIT","E51",5,8]
["5/7/SPE","5/7/6L","5/7/E51",43410,"6L","SPE","SIT","E51",5,7]
["5/8/SPE","5/8/6L","5/8/E51",43410,"6L","SPE","SIT","E51",5,8]
["5/7/ISE","5/7/6K","5/7/N02",43410,"6K","ISE","SBC","N02",5,7]
["5/8/ISE","5/8/6K","5/8/N02",43410,"6K","ISE","SBC","N02",5,8]
["5/7/ISE","5/7/6L","5/7/N02",43410,"6L","ISE","SBC","N02",5,7]
["5/8/ISE","5/8/6L","5/8/N02",43410,"6L","ISE","SBC","N02",5,8]
["5/7/ISE","5/7/6B","5/7/N02",43410,"6B","ISE","SBC","N02",5,7]
["5/8/ISE","5/8/6B","5/8/N02",43410,"6B","ISE","SBC","N02",5,8]
["5/7/ISE","5/7/6D","5/7/N02",43410,"6D","ISE","SBC","N02",5,7]
["5/8/ISE","5/8/6D","5/8/N02",43410,"6D","ISE","SBC","N02",5,8]
["5/7/HAN","5/7/6K","5/7/N17",43410,"6K","HAN","SBC","N17",5,7]
["5/8/HAN","5/8/6K","5/8/N17",43410,"6K","HAN","SBC","N17",5,8]
["5/7/HAN","5/7/6L","5/7/N17",43410,"6L","HAN","SBC","N17",5,7]
["5/8/HAN","5/8/6L","5/8/N17",43410,"6L","HAN","SBC","N17",5,8]
["5/7/HAN","5/7/6B","5/7/N17",43410,"6B","HAN","SBC","N17",5,7]
["5/8/HAN","5/8/6B","5/8/N17",43410,"6B","HAN","SBC","N17",5,8]
["5/7/HAN","5/7/6D","5/7/N17",43410,"6D","HAN","SBC","N17",5,7]
["5/8/HAN","5/8/6D","5/8/N17",43410,"6D","HAN","SBC","N17",5,8]
["5/7/HUJ","5/7/6K","5/7/122",43410,"6K","HUJ","SBG",122,5,7]
["5/8/HUJ","5/8/6K","5/8/122",43410,"6K","HUJ","SBG",122,5,8]
["5/7/HUJ","5/7/6C","5/7/122",43410,"6C","HUJ","SBG",122,5,7]
["5/8/HUJ","5/8/6C","5/8/122",43410,"6C","HUJ","SBG",122,5,8]
["5/7/CHI","5/7/6K","5/7/110",43410,"6K","CHI","SPM",110,5,7]
["5/8/CHI","5/8/6K","5/8/110",43410,"6K","CHI","SPM",110,5,8]
["5/7/CHI","5/7/6L","5/7/110",43410,"6L","CHI","SPM",110,5,7]
["5/8/CHI","5/8/6L","5/8/110",43410,"6L","CHI","SPM",110,5,8]
["5/7/CHI","5/7/6B","5/7/110",43410,"6B","CHI","SPM",110,5,7]
["5/8/CHI","5/8/6B","5/8/110",43410,"6B","CHI","SPM",110,5,8]
["5/7/CHI","5/7/6D","5/7/110",43410,"6D","CHI","SPM",110,5,7]
["5/8/CHI","5/8/6D","5/8/110",43410,"6D","CHI","SPM",110,5,8]
["5/7/UNT","5/7/6K","5/7/222",43410,"6K","UNT","SMU",222,5,7]
["5/8/UNT","5/8/6K","5/8/222",43410,"6K","UNT","SMU",222,5,8]
["5/7/UNT","5/7/6D","5/7/222",43410,"6D","UNT","SMU",222,5,7]
["5/8/UNT","5/8/6D","5/8/222",43410,"6D","UNT","SMU",222,5,8]
["5/7/GER","5/7/6C","5/7/208",43410,"6C","GER","SWR",208,5,7]
["5/8/GER","5/8/6C","5/8/208",43410,"6C","GER","SWR",208,5,8]
[{"$f":"CONCATENATE($I167,\"/\",$J167,\"/\",$F167)","v":"2/1/SPE"},{"$f":"CONCATENATE($I167,\"/\",$J167,\"/\",$E167)","v":"2/1/6A"},{"$f":"CONCATENATE($I167,\"/\",$J167,\"/\",$H167)","v":"2/1/E51"},2333,"6A","SPE","SIT","E51",2,1]
["2/2/SPE","2/2/6A","2/2/E51",2333,"6A","SPE","SIT","E51",2,2]
["2/1/SPE","2/1/6K","2/1/E51",2333,"6K","SPE","SIT","E51",2,1]
["2/2/SPE","2/2/6K","2/2/E51",2333,"6K","SPE","SIT","E51",2,2]
["2/1/SPE","2/1/6L","2/1/E51",2333,"6L","SPE","SIT","E51",2,1]
["2/2/SPE","2/2/6L","2/2/E51",2333,"6L","SPE","SIT","E51",2,2]
["2/1/WER","2/1/6K","2/1/N01",2333,"6K","WER","SBC","N01",2,1]
["2/2/WER","2/2/6K","2/2/N01",2333,"6K","WER","SBC","N01",2,2]
["2/1/WER","2/1/6L","2/1/N01",2333,"6L","WER","SBC","N01",2,1]
["2/2/WER","2/2/6L","2/2/N01",2333,"6L","WER","SBC","N01",2,2]
["2/1/WER","2/1/6B","2/1/N01",2333,"6B","WER","SBC","N01",2,1]
["2/2/WER","2/2/6B","2/2/N01",2333,"6B","WER","SBC","N01",2,2]
["2/1/WER","2/1/6D","2/1/N01",2333,"6D","WER","SBC","N01",2,1]
["2/2/WER","2/2/6D","2/2/N01",2333,"6D","WER","SBC","N01",2,2]
["2/1/HAN","2/1/6K","2/1/N17",2333,"6K","HAN","SBC","N17",2,1]
["2/2/HAN","2/2/6K","2/2/N17",2333,"6K","HAN","SBC","N17",2,2]
["2/1/HAN","2/1/6L","2/1/N17",2333,"6L","HAN","SBC","N17",2,1]
["2/2/HAN","2/2/6L","2/2/N17",2333,"6L","HAN","SBC","N17",2,2]
["2/1/HAN","2/1/6B","2/1/N17",2333,"6B","HAN","SBC","N17",2,1]
["2/2/HAN","2/2/6B","2/2/N17",2333,"6B","HAN","SBC","N17",2,2]
["2/1/HAN","2/1/6D","2/1/N17",2333,"6D","HAN","SBC","N17",2,1]
["2/2/HAN","2/2/6D","2/2/N17",2333,"6D","HAN","SBC","N17",2,2]
["2/1/HUJ","2/1/6K","2/1/122",2333,"6K","HUJ","SBG",122,2,1]
["2/2/HUJ","2/2/6K","2/2/122",2333,"6K","HUJ","SBG",122,2,2]
["2/1/HUJ","2/1/6C","2/1/122",2333,"6C","HUJ","SBG",122,2,1]
["2/2/HUJ","2/2/6C","2/2/122",2333,"6C","HUJ","SBG",122,2,2]
["2/1/CHI","2/1/6K","2/1/107",2333,"6K","CHI","SPM",107,2,1]
["2/2/CHI","2/2/6K","2/2/107",2333,"6K","CHI","SPM",107,2,2]
["2/1/CHI","2/1/6L","2/1/107",2333,"6L","CHI","SPM",107,2,1]
["2/2/CHI","2/2/6L","2/2/107",2333,"6L","CHI","SPM",107,2,2]
["2/1/CHI","2/1/6B","2/1/107",2333,"6B","CHI","SPM",107,2,1]
["2/2/CHI","2/2/6B","2/2/107",2333,"6B","CHI","SPM",107,2,2]
["2/1/CHI","2/1/6D","2/1/107",2333,"6D","CHI","SPM",107,2,1]
["2/2/CHI","2/2/6D","2/2/107",2333,"6D","CHI","SPM",107,2,2]
["2/1/GUH","2/1/6K","2/1/118",2333,"6K","GUH","SPM",118,2,1]
["2/2/GUH","2/2/6K","2/2/118",2333,"6K","GUH","SPM",118,2,2]
["2/1/GUH","2/1/6L","2/1/118",2333,"6L","GUH","SPM",118,2,1]
["2/2/GUH","2/2/6L","2/2/118",2333,"6L","GUH","SPM",118,2,2]
["2/1/GUH","2/1/6B","2/1/118",2333,"6B","GUH","SPM",118,2,1]
["2/2/GUH","2/2/6B","2/2/118",2333,"6B","GUH","SPM",118,2,2]
["2/1/GUH","2/1/6D","2/1/118",2333,"6D","GUH","SPM",118,2,1]
["2/2/GUH","2/2/6D","2/2/118",2333,"6D","GUH","SPM",118,2,2]
["2/1/KUT","2/1/6D","2/1/208",2333,"6D","KUT","SWR",208,2,1]
["2/2/KUT","2/2/6D","2/2/208",2333,"6D","KUT","SWR",208,2,2]
["2/1/SAR","2/1/6C","2/1/210",2333,"6C","SAR","SWR",210,2,1]
["2/2/SAR","2/2/6C","2/2/210",2333,"6C","SAR","SWR",210,2,2]
["3/1/SPE","3/1/5A","3/1/E51",43406,"5A","SPE","SIT","E51",3,1]
["3/2/SPE","3/2/5A","3/2/E51",43406,"5A","SPE","SIT","E51",3,2]
["3/1/SPE","3/1/5L","3/1/E51",43406,"5L","SPE","SIT","E51",3,1]
["3/2/SPE","3/2/5L","3/2/E51",43406,"5L","SPE","SIT","E51",3,2]
["3/1/ISE","3/1/5L","3/1/N02",43406,"5L","ISE","SBC","N02",3,1]
["3/2/ISE","3/2/5L","3/2/N02",43406,"5L","ISE","SBC","N02",3,2]
["3/1/ISE","3/1/5B","3/1/N02",43406,"5B","ISE","SBC","N02",3,1]
["3/2/ISE","3/2/5B","3/2/N02",43406,"5B","ISE","SBC","N02",3,2]
["3/1/ISE","3/1/5K","3/1/N02",43406,"5K","ISE","SBC","N02",3,1]
["3/2/ISE","3/2/5K","3/2/N02",43406,"5K","ISE","SBC","N02",3,2]
["3/1/HAN","3/1/5L","3/1/N17",43406,"5L","HAN","SBC","N17",3,1]
["3/2/HAN","3/2/5L","3/2/N17",43406,"5L","HAN","SBC","N17",3,2]
["3/1/HAN","3/1/5B","3/1/N17",43406,"5B","HAN","SBC","N17",3,1]
["3/2/HAN","3/2/5B","3/2/N17",43406,"5B","HAN","SBC","N17",3,2]
["3/1/HAN","3/1/5K","3/1/N17",43406,"5K","HAN","SBC","N17",3,1]
["3/2/HAN","3/2/5K","3/2/N17",43406,"5K","HAN","SBC","N17",3,2]
["3/1/SRO","3/1/5L","3/1/107",43406,"5L","SRO","SPM",107,3,1]
["3/2/SRO","3/2/5L","3/2/107",43406,"5L","SRO","SPM",107,3,2]
[{"$f":"CONCATENATE($I231,\"/\",$J231,\"/\",$F231)","v":"3/1/SRO"},{"$f":"CONCATENATE($I231,\"/\",$J231,\"/\",$E231)","v":"3/1/5B"},{"$f":"CONCATENATE($I231,\"/\",$J231,\"/\",$H231)","v":"3/1/107"},43406,"5B","SRO","SPM",107,3,1]
["3/2/SRO","3/2/5B","3/2/107",43406,"5B","SRO","SPM",107,3,2]
["3/1/SRO","3/1/5K","3/1/107",43406,"5K","SRO","SPM",107,3,1]
["3/2/SRO","3/2/5K","3/2/107",43406,"5K","SRO","SPM",107,3,2]
["3/1/SIE","3/1/5L","3/1/U47",43406,"5L","SIE","SBG","U47",3,1]
["3/2/SIE","3/2/5L","3/2/U47",43406,"5L","SIE","SBG","U47",3,2]
["3/1/SIE","3/1/5E","3/1/U47",43406,"5E","SIE","SBG","U47",3,1]
["3/2/SIE","3/2/5E","3/2/U47",43406,"5E","SIE","SBG","U47",3,2]
["3/1/THM","3/1/5L","3/1/22",43406,"5L","THM","SMU",22,3,1]
["3/2/THM","3/2/5L","3/2/22",43406,"5L","THM","SMU",22,3,2]
["3/1/THM","3/1/5B","3/1/22",43406,"5B","THM","SMU",22,3,1]
["3/2/THM","3/2/5B","3/2/22",43406,"5B","THM","SMU",22,3,2]
["3/1/THM","3/1/5K","3/1/22",43406,"5K","THM","SMU",22,3,1]
["3/2/THM","3/2/5K","3/2/22",43406,"5K","THM","SMU",22,3,2]
["3/1/KUT","3/1/5L","3/1/117",43406,"5L","KUT","SWR",117,3,1]
["3/2/KUT","3/2/5L","3/2/117",43406,"5L","KUT","SWR",117,3,2]
["3/1/KUT","3/1/5B","3/1/117",43406,"5B","KUT","SWR",117,3,1]
["3/2/KUT","3/2/5B","3/2/117",43406,"5B","KUT","SWR",117,3,2]
["3/1/KUT","3/1/5K","3/1/117",43406,"5K","KUT","SWR",117,3,1]
["3/2/KUT","3/2/5K","3/2/117",43406,"5K","KUT","SWR",117,3,2]
["3/1/KUT","3/1/5D","3/1/117",43406,"5D","KUT","SWR",117,3,1]
["3/2/KUT","3/2/5D","3/2/117",43406,"5D","KUT","SWR",117,3,2]
["3/1/GER","3/1/5L","3/1/208",43406,"5L","GER","SWR",208,3,1]
["3/2/GER","3/2/5L","3/2/208",43406,"5L","GER","SWR",208,3,2]
["3/1/GER","3/1/5B","3/1/208",43406,"5B","GER","SWR",208,3,1]
["3/2/GER","3/2/5B","3/2/208",43406,"5B","GER","SWR",208,3,2]
["3/1/GER","3/1/5K","3/1/208",43406,"5K","GER","SWR",208,3,1]
["3/2/GER","3/2/5K","3/2/208",43406,"5K","GER","SWR",208,3,2]
["3/1/GER","3/1/5D","3/1/208",43406,"5D","GER","SWR",208,3,1]
["3/2/GER","3/2/5D","3/2/208",43406,"5D","GER","SWR",208,3,2]
["1/7/SPE","1/7/5A","1/7/E51",1889,"5A","SPE","SIT","E51",1,7]
["1/8/SPE","1/8/5A","1/8/E51",1889,"5A","SPE","SIT","E51",1,8]
["1/7/SPE","1/7/5L","1/7/E51",1889,"5L","SPE","SIT","E51",1,7]
["1/8/SPE","1/8/5L","1/8/E51",1889,"5L","SPE","SIT","E51",1,8]
["1/7/ISE","1/7/5L","1/7/N02",1889,"5L","ISE","SBC","N02",1,7]
["1/8/ISE","1/8/5L","1/8/N02",1889,"5L","ISE","SBC","N02",1,8]
["1/7/ISE","1/7/5B","1/7/N02",1889,"5B","ISE","SBC","N02",1,7]
["1/8/ISE","1/8/5B","1/8/N02",1889,"5B","ISE","SBC","N02",1,8]
["1/7/ISE","1/7/5K","1/7/N02",1889,"5K","ISE","SBC","N02",1,7]
["1/8/ISE","1/8/5K","1/8/N02",1889,"5K","ISE","SBC","N02",1,8]
["1/7/HAN","1/7/5L","1/7/N17",1889,"5L","HAN","SBC","N17",1,7]
["1/8/HAN","1/8/5L","1/8/N17",1889,"5L","HAN","SBC","N17",1,8]
["1/7/HAN","1/7/5B","1/7/N17",1889,"5B","HAN","SBC","N17",1,7]
["1/8/HAN","1/8/5B","1/8/N17",1889,"5B","HAN","SBC","N17",1,8]
["1/7/HAN","1/7/5K","1/7/N17",1889,"5K","HAN","SBC","N17",1,7]
["1/8/HAN","1/8/5K","1/8/N17",1889,"5K","HAN","SBC","N17",1,8]
["1/7/GUH","1/7/5L","1/7/118",1889,"5L","GUH","SPM",118,1,7]
["1/8/GUH","1/8/5L","1/8/118",1889,"5L","GUH","SPM",118,1,8]
["1/7/GUH","1/7/5B","1/7/118",1889,"5B","GUH","SPM",118,1,7]
["1/8/GUH","1/8/5B","1/8/118",1889,"5B","GUH","SPM",118,1,8]
["1/7/GUH","1/7/5K","1/7/118",1889,"5K","GUH","SPM",118,1,7]
["1/8/GUH","1/8/5K","1/8/118",1889,"5K","GUH","SPM",118,1,8]
["1/7/SIE","1/7/5L","1/7/U47",1889,"5L","SIE","SBG","U47",1,7]
["1/8/SIE","1/8/5L","1/8/U47",1889,"5L","SIE","SBG","U47",1,8]
["1/7/SIE","1/7/5E","1/7/U47",1889,"5E","SIE","SBG","U47",1,7]
["1/8/SIE","1/8/5E","1/8/U47",1889,"5E","SIE","SBG","U47",1,8]
["1/7/THM","1/7/5L","1/7/22",1889,"5L","THM","SMU",22,1,7]
["1/8/THM","1/8/5L","1/8/22",1889,"5L","THM","SMU",22,1,8]
["1/7/THM","1/7/5B","1/7/22",1889,"5B","THM","SMU",22,1,7]
["1/8/THM","1/8/5B","1/8/22",1889,"5B","THM","SMU",22,1,8]
["1/7/THM","1/7/5K","1/7/22",1889,"5K","THM","SMU",22,1,7]
["1/8/THM","1/8/5K","1/8/22",1889,"5K","THM","SMU",22,1,8]
["1/7/KUT","1/7/5L","1/7/208",1889,"5L","KUT","SWR",208,1,7]
["1/8/KUT","1/8/5L","1/8/208",1889,"5L","KUT","SWR",208,1,8]
[{"$f":"CONCATENATE($I295,\"/\",$J295,\"/\",$F295)","v":"1/7/KUT"},{"$f":"CONCATENATE($I295,\"/\",$J295,\"/\",$E295)","v":"1/7/5B"},{"$f":"CONCATENATE($I295,\"/\",$J295,\"/\",$H295)","v":"1/7/208"},1889,"5B","KUT","SWR",208,1,7]
["1/8/KUT","1/8/5B","1/8/208",1889,"5B","KUT","SWR",208,1,8]
["1/7/KUT","1/7/5K","1/7/208",1889,"5K","KUT","SWR",208,1,7]
["1/8/KUT","1/8/5K","1/8/208",1889,"5K","KUT","SWR",208,1,8]
["1/7/KUT","1/7/5D","1/7/208",1889,"5D","KUT","SWR",208,1,7]
["1/8/KUT","1/8/5D","1/8/208",1889,"5D","KUT","SWR",208,1,8]
["1/7/SAR","1/7/5L","1/7/210",1889,"5L","SAR","SWR",210,1,7]
["1/8/SAR","1/8/5L","1/8/210",1889,"5L","SAR","SWR",210,1,8]
["1/7/SAR","1/7/5B","1/7/210",1889,"5B","SAR","SWR",210,1,7]
["1/8/SAR","1/8/5B","1/8/210",1889,"5B","SAR","SWR",210,1,8]
["1/7/SAR","1/7/5K","1/7/210",1889,"5K","SAR","SWR",210,1,7]
["1/8/SAR","1/8/5K","1/8/210",1889,"5K","SAR","SWR",210,1,8]
["1/7/SAR","1/7/5D","1/7/210",1889,"5D","SAR","SWR",210,1,7]
["1/8/SAR","1/8/5D","1/8/210",1889,"5D","SAR","SWR",210,1,8]
["5/2/NEL","5/2/4A","5/2/E52",43412,"4A","NEL","SIT","E52",5,2]
["5/2/NEL","5/2/4K","5/2/E52",43412,"4K","NEL","SIT","E52",5,2]
["5/2/NEL","5/2/4L","5/2/E52",43412,"4L","NEL","SIT","E52",5,2]
["5/2/MEZ","5/2/4L","5/2/N01",43412,"4L","MEZ","SBC","N01",5,2]
["5/2/MEZ","5/2/4G","5/2/N01",43412,"4G","MEZ","SBC","N01",5,2]
["5/2/KAP","5/2/4L","5/2/N06",43412,"4L","KAP","SBC","N06",5,2]
["5/2/KAP","5/2/4G","5/2/N06",43412,"4G","KAP","SBC","N06",5,2]
["5/2/BRG","5/2/4L","5/2/~N12~N15",43412,"4L","BRG","SBC","~N12~N15",5,2]
["5/2/BRG","5/2/4G","5/2/~N12~N15",43412,"4G","BRG","SBC","~N12~N15",5,2]
["5/2/GUH","5/2/4K","5/2/118",43412,"4K","GUH","SPM",118,5,2]
["5/2/GUH","5/2/4L","5/2/118",43412,"4L","GUH","SPM",118,5,2]
["5/2/GUH","5/2/4C","5/2/118",43412,"4C","GUH","SPM",118,5,2]
["5/2/STC","5/2/4A","5/2/122",43412,"4A","STC","SBG",122,5,2]
["5/2/STC","5/2/4K","5/2/122",43412,"4K","STC","SBG",122,5,2]
["5/2/STC","5/2/4L","5/2/122",43412,"4L","STC","SBG",122,5,2]
["5/2/STC","5/2/4B","5/2/122",43412,"4B","STC","SBG",122,5,2]
["5/2/HUJ","5/2/4A","5/2/119",43412,"4A","HUJ","SBG",119,5,2]
["5/2/HUJ","5/2/4K","5/2/119",43412,"4K","HUJ","SBG",119,5,2]
["5/2/HUJ","5/2/4L","5/2/119",43412,"4L","HUJ","SBG",119,5,2]
["5/2/HUJ","5/2/4B","5/2/119",43412,"4B","HUJ","SBG",119,5,2]
["5/2/UNT","5/2/4L","5/2/22",43412,"4L","UNT","SMU",22,5,2]
["5/2/UNT","5/2/4B","5/2/22",43412,"4B","UNT","SMU",22,5,2]
["5/2/GER","5/2/4K","5/2/208",43412,"4K","GER","SWR",208,5,2]
["5/2/GER","5/2/4L","5/2/208",43412,"4L","GER","SWR",208,5,2]
["5/2/GER","5/2/4C","5/2/208",43412,"4C","GER","SWR",208,5,2]
["5/2/GER","5/2/4D","5/2/208",43412,"4D","GER","SWR",208,5,2]
["5/2/SAR","5/2/4K","5/2/210",43412,"4K","SAR","SWR",210,5,2]
["5/2/SAR","5/2/4L","5/2/210",43412,"4L","SAR","SWR",210,5,2]
["5/2/SAR","5/2/4C","5/2/210",43412,"4C","SAR","SWR",210,5,2]
["5/2/SAR","5/2/4D","5/2/210",43412,"4D","SAR","SWR",210,5,2]
["5/1/NEL","5/1/4A","5/1/E52",43404,"4A","NEL","SIT","E52",5,1]
["5/1/NEL","5/1/4K","5/1/E52",43404,"4K","NEL","SIT","E52",5,1]
["5/1/NEL","5/1/4L","5/1/E52",43404,"4L","NEL","SIT","E52",5,1]
["5/1/MEZ","5/1/4L","5/1/N01",43404,"4L","MEZ","SBC","N01",5,1]
["5/1/MEZ","5/1/4G","5/1/N01",43404,"4G","MEZ","SBC","N01",5,1]
["5/1/KAP","5/1/4L","5/1/N06",43404,"4L","KAP","SBC","N06",5,1]
["5/1/KAP","5/1/4G","5/1/N06",43404,"4G","KAP","SBC","N06",5,1]
["5/1/BRG","5/1/4L","5/1/~N12~N15",43404,"4L","BRG","SBC","~N12~N15",5,1]
["5/1/BRG","5/1/4G","5/1/~N12~N15",43404,"4G","BRG","SBC","~N12~N15",5,1]
["5/1/GUH","5/1/4K","5/1/118",43404,"4K","GUH","SPM",118,5,1]
["5/1/GUH","5/1/4L","5/1/118",43404,"4L","GUH","SPM",118,5,1]
["5/1/GUH","5/1/4C","5/1/118",43404,"4C","GUH","SPM",118,5,1]
["5/1/STC","5/1/4A","5/1/122",43404,"4A","STC","SBG",122,5,1]
["5/1/STC","5/1/4K","5/1/122",43404,"4K","STC","SBG",122,5,1]
["5/1/STC","5/1/4L","5/1/122",43404,"4L","STC","SBG",122,5,1]
["5/1/STC","5/1/4B","5/1/122",43404,"4B","STC","SBG",122,5,1]
["5/1/HUJ","5/1/4A","5/1/119",43404,"4A","HUJ","SBG",119,5,1]
["5/1/HUJ","5/1/4K","5/1/119",43404,"4K","HUJ","SBG",119,5,1]
["5/1/HUJ","5/1/4L","5/1/119",43404,"4L","HUJ","SBG",119,5,1]
["5/1/HUJ","5/1/4B","5/1/119",43404,"4B","HUJ","SBG",119,5,1]
[{"$f":"CONCATENATE($I359,\"/\",$J359,\"/\",$F359)","v":"5/1/GER"},{"$f":"CONCATENATE($I359,\"/\",$J359,\"/\",$E359)","v":"5/1/4K"},{"$f":"CONCATENATE($I359,\"/\",$J359,\"/\",$H359)","v":"5/1/208"},43404,"4K","GER","SWR",208,5,1]
["5/1/GER","5/1/4L","5/1/208",43404,"4L","GER","SWR",208,5,1]
["5/1/GER","5/1/4C","5/1/208",43404,"4C","GER","SWR",208,5,1]
["5/1/GER","5/1/4D","5/1/208",43404,"4D","GER","SWR",208,5,1]
["5/1/SAR","5/1/4K","5/1/210",43404,"4K","SAR","SWR",210,5,1]
["5/1/SAR","5/1/4L","5/1/210",43404,"4L","SAR","SWR",210,5,1]
["5/1/SAR","5/1/4C","5/1/210",43404,"4C","SAR","SWR",210,5,1]
["5/1/SAR","5/1/4D","5/1/210",43404,"4D","SAR","SWR",210,5,1]
["3/7/NEL","3/7/4A","3/7/E52",1371,"4A","NEL","SIT","E52",3,7]
["3/8/NEL","3/8/4A","3/8/E52",1371,"4A","NEL","SIT","E52",3,8]
["3/7/NEL","3/7/4K","3/7/E52",1371,"4K","NEL","SIT","E52",3,7]
["3/8/NEL","3/8/4K","3/8/E52",1371,"4K","NEL","SIT","E52",3,8]
["3/7/NEL","3/7/4L","3/7/E52",1371,"4L","NEL","SIT","E52",3,7]
["3/8/NEL","3/8/4L","3/8/E52",1371,"4L","NEL","SIT","E52",3,8]
["3/7/MEZ","3/7/4L","3/7/N01",1371,"4L","MEZ","SBC","N01",3,7]
["3/8/MEZ","3/8/4L","3/8/N01",1371,"4L","MEZ","SBC","N01",3,8]
["3/7/MEZ","3/7/4G","3/7/N01",1371,"4G","MEZ","SBC","N01",3,7]
["3/8/MEZ","3/8/4G","3/8/N01",1371,"4G","MEZ","SBC","N01",3,8]
["3/7/BRG","3/7/4L","3/7/N12",1371,"4L","BRG","SBC","N12",3,7]
["3/8/BRG","3/8/4L","3/8/N12",1371,"4L","BRG","SBC","N12",3,8]
["3/7/BRG","3/7/4G","3/7/N12",1371,"4G","BRG","SBC","N12",3,7]
["3/8/BRG","3/8/4G","3/8/N12",1371,"4G","BRG","SBC","N12",3,8]
["3/7/HAN","3/7/4L","3/7/~N15~N17",1371,"4L","HAN","SBC","~N15~N17",3,7]
["3/8/HAN","3/8/4L","3/8/~N15~N17",1371,"4L","HAN","SBC","~N15~N17",3,8]
["3/7/HAN","3/7/4G","3/7/~N15~N17",1371,"4G","HAN","SBC","~N15~N17",3,7]
["3/8/HAN","3/8/4G","3/8/~N15~N17",1371,"4G","HAN","SBC","~N15~N17",3,8]
["3/7/CHI","3/7/4K","3/7/107",1371,"4K","CHI","SPM",107,3,7]
["3/8/CHI","3/8/4K","3/8/107",1371,"4K","CHI","SPM",107,3,8]
["3/7/CHI","3/7/4L","3/7/107",1371,"4L","CHI","SPM",107,3,7]
["3/8/CHI","3/8/4L","3/8/107",1371,"4L","CHI","SPM",107,3,8]
["3/7/CHI","3/7/4C","3/7/107",1371,"4C","CHI","SPM",107,3,7]
["3/8/CHI","3/8/4C","3/8/107",1371,"4C","CHI","SPM",107,3,8]
["3/7/STC","3/7/4A","3/7/122",1371,"4A","STC","SBG",122,3,7]
["3/8/STC","3/8/4A","3/8/122",1371,"4A","STC","SBG",122,3,8]
["3/7/STC","3/7/4K","3/7/122",1371,"4K","STC","SBG",122,3,7]
["3/8/STC","3/8/4K","3/8/122",1371,"4K","STC","SBG",122,3,8]
["3/7/STC","3/7/4L","3/7/122",1371,"4L","STC","SBG",122,3,7]
["3/8/STC","3/8/4L","3/8/122",1371,"4L","STC","SBG",122,3,8]
["3/7/STC","3/7/4B","3/7/122",1371,"4B","STC","SBG",122,3,7]
["3/8/STC","3/8/4B","3/8/122",1371,"4B","STC","SBG",122,3,8]
["3/7/HUJ","3/7/4A","3/7/119",1371,"4A","HUJ","SBG",119,3,7]
["3/8/HUJ","3/8/4A","3/8/119",1371,"4A","HUJ","SBG",119,3,8]
["3/7/HUJ","3/7/4K","3/7/119",1371,"4K","HUJ","SBG",119,3,7]
["3/8/HUJ","3/8/4K","3/8/119",1371,"4K","HUJ","SBG",119,3,8]
["3/7/HUJ","3/7/4L","3/7/119",1371,"4L","HUJ","SBG",119,3,7]
["3/8/HUJ","3/8/4L","3/8/119",1371,"4L","HUJ","SBG",119,3,8]
["3/7/HUJ","3/7/4B","3/7/119",1371,"4B","HUJ","SBG",119,3,7]
["3/8/HUJ","3/8/4B","3/8/119",1371,"4B","HUJ","SBG",119,3,8]
["3/7/UNT","3/7/4L","3/7/22",1371,"4L","UNT","SMU",22,3,7]
["3/8/UNT","3/8/4L","3/8/22",1371,"4L","UNT","SMU",22,3,8]
["3/7/UNT","3/7/4B","3/7/22",1371,"4B","UNT","SMU",22,3,7]
["3/8/UNT","3/8/4B","3/8/22",1371,"4B","UNT","SMU",22,3,8]
["3/7/GER","3/7/4K","3/7/208",1371,"4K","GER","SWR",208,3,7]
["3/8/GER","3/8/4K","3/8/208",1371,"4K","GER","SWR",208,3,8]
["3/7/GER","3/7/4L","3/7/208",1371,"4L","GER","SWR",208,3,7]
["3/8/GER","3/8/4L","3/8/208",1371,"4L","GER","SWR",208,3,8]
["3/7/GER","3/7/4C","3/7/208",1371,"4C","GER","SWR",208,3,7]
["3/8/GER","3/8/4C","3/8/208",1371,"4C","GER","SWR",208,3,8]
["3/7/GER","3/7/4D","3/7/208",1371,"4D","GER","SWR",208,3,7]
["3/8/GER","3/8/4D","3/8/208",1371,"4D","GER","SWR",208,3,8]
["3/7/SAR","3/7/4K","3/7/210",1371,"4K","SAR","SWR",210,3,7]
["3/8/SAR","3/8/4K","3/8/210",1371,"4K","SAR","SWR",210,3,8]
["3/7/SAR","3/7/4L","3/7/210",1371,"4L","SAR","SWR",210,3,7]
["3/8/SAR","3/8/4L","3/8/210",1371,"4L","SAR","SWR",210,3,8]
[{"$f":"CONCATENATE($I423,\"/\",$J423,\"/\",$F423)","v":"3/7/SAR"},{"$f":"CONCATENATE($I423,\"/\",$J423,\"/\",$E423)","v":"3/7/4C"},{"$f":"CONCATENATE($I423,\"/\",$J423,\"/\",$H423)","v":"3/7/210"},1371,"4C","SAR","SWR",210,3,7]
["3/8/SAR","3/8/4C","3/8/210",1371,"4C","SAR","SWR",210,3,8]
["3/7/SAR","3/7/4D","3/7/210",1371,"4D","SAR","SWR",210,3,7]
["3/8/SAR","3/8/4D","3/8/210",1371,"4D","SAR","SWR",210,3,8]
["2/1/GRM","2/1/3C","2/1/THU",43350,"3C","GRM","SH","THU",2,1]
["2/2/GRM","2/2/3C","2/2/THU",43350,"3C","GRM","SH","THU",2,2]
["2/1/GRM","2/1/3D","2/1/THU",43350,"3D","GRM","SH","THU",2,1]
["2/2/GRM","2/2/3D","2/2/THU",43350,"3D","GRM","SH","THU",2,2]
["2/1/WEY","2/1/3C","2/1/TS2",43350,"3C","WEY","SD","TS2",2,1]
["2/2/WEY","2/2/3C","2/2/TS2",43350,"3C","WEY","SD","TS2",2,2]
["2/1/WEY","2/1/3D","2/1/TS2",43350,"3D","WEY","SD","TS2",2,1]
["2/2/WEY","2/2/3D","2/2/TS2",43350,"3D","WEY","SD","TS2",2,2]
["3/3/GRM","3/3/3C","3/3/THU",1069,"3C","GRM","SH","THU",3,3]
["3/3/GRM","3/3/3D","3/3/THU",1069,"3D","GRM","SH","THU",3,3]
["3/3/WEY","3/3/3C","3/3/THO",1069,"3C","WEY","SD","THO",3,3]
["3/3/WEY","3/3/3D","3/3/THO",1069,"3D","WEY","SD","THO",3,3]
["5/4/STU","5/4/2C","5/4/THU",43368,"2C","STU","SH","THU",5,4]
["5/4/STU","5/4/2D","5/4/THU",43368,"2D","STU","SH","THU",5,4]
["5/4/STS","5/4/2C","5/4/THO",43368,"2C","STS","SD","THO",5,4]
["5/4/STS","5/4/2D","5/4/THO",43368,"2D","STS","SD","THO",5,4]
["2/3/STU","2/3/2C","2/3/TE2",699,"2C","STU","SH","TE2",2,3]
["2/4/STU","2/4/2C","2/4/TE2",699,"2C","STU","SH","TE2",2,4]
["2/3/STU","2/3/2D","2/3/TE2",699,"2D","STU","SH","TE2",2,3]
["2/4/STU","2/4/2D","2/4/TE2",699,"2D","STU","SH","TE2",2,4]
["2/3/STS","2/3/2C","2/3/TS1",699,"2C","STS","SD","TS1",2,3]
["2/4/STS","2/4/2C","2/4/TS1",699,"2C","STS","SD","TS1",2,4]
["2/3/STS","2/3/2D","2/3/TS1",699,"2D","STS","SD","TS1",2,3]
["2/4/STS","2/4/2D","2/4/TS1",699,"2D","STS","SD","TS1",2,4]
["5/1/STU","5/1/2A","5/1/THU",43370,"2A","STU","SH","THU",5,1]
["5/1/STU","5/1/2B","5/1/THU",43370,"2B","STU","SH","THU",5,1]
["5/1/STU","5/1/2E","5/1/THU",43370,"2E","STU","SH","THU",5,1]
["5/1/STS","5/1/2A","5/1/THO",43370,"2A","STS","SD","THO",5,1]
["5/1/STS","5/1/2E","5/1/THO",43370,"2E","STS","SD","THO",5,1]
["1/1/STU","1/1/2A","1/1/THU",551,"2A","STU","SH","THU",1,1]
["1/2/STU","1/2/2A","1/2/THU",551,"2A","STU","SH","THU",1,2]
["1/1/STU","1/1/2B","1/1/THU",551,"2B","STU","SH","THU",1,1]
["1/2/STU","1/2/2B","1/2/THU",551,"2B","STU","SH","THU",1,2]
["1/1/STU","1/1/2E","1/1/THU",551,"2E","STU","SH","THU",1,1]
["1/2/STU","1/2/2E","1/2/THU",551,"2E","STU","SH","THU",1,2]
["1/1/STS","1/1/2A","1/1/TS1",551,"2A","STS","SD","TS1",1,1]
["1/2/STS","1/2/2A","1/2/TS1",551,"2A","STS","SD","TS1",1,2]
["1/1/STS","1/1/2E","1/1/TS1",551,"2E","STS","SD","TS1",1,1]
["1/2/STS","1/2/2E","1/2/TS1",551,"2E","STS","SD","TS1",1,2]
["1/1/RUT","1/1/2B","1/1/TE1",551,"2B","RUT","SD","TE1",1,1]
["1/2/RUT","1/2/2B","1/2/TE1",551,"2B","RUT","SD","TE1",1,2]
["1/1/RUT","1/1/2E","1/1/TE1",551,"2E","RUT","SD","TE1",1,1]
["1/2/RUT","1/2/2E","1/2/TE1",551,"2E","RUT","SD","TE1",1,2]
["1/7/FRA","1/7/4D","1/7/TE1",43342,"4D","FRA","SH","TE1",1,7]
["1/8/FRA","1/8/4D","1/8/TE1",43342,"4D","FRA","SH","TE1",1,8]
["1/7/FRA","1/7/4G","1/7/TE1",43342,"4G","FRA","SH","TE1",1,7]
["1/8/FRA","1/8/4G","1/8/TE1",43342,"4G","FRA","SH","TE1",1,8]
["1/7/BAS","1/7/4D","1/7/TS1",43342,"4D","BAS","SD","TS1",1,7]
["1/8/BAS","1/8/4D","1/8/TS1",43342,"4D","BAS","SD","TS1",1,8]
["1/7/BAS","1/7/4G","1/7/TS1",43342,"4G","BAS","SD","TS1",1,7]
["1/8/BAS","1/8/4G","1/8/TS1",43342,"4G","BAS","SD","TS1",1,8]
["3/2/FRA","3/2/4D","3/2/THU",1587,"4D","FRA","SH","THU",3,2]
["3/2/FRA","3/2/4G","3/2/THU",1587,"4G","FRA","SH","THU",3,2]
["3/2/BAS","3/2/4D","3/2/THO",1587,"4D","BAS","SD","THO",3,2]
["3/2/BAS","3/2/4G","3/2/THO",1587,"4G","BAS","SD","THO",3,2]
["1/9/GRM","1/9/4A","1/9/TE2",43346,"4A","GRM","SH","TE2",1,9]
["1/10/GRM","1/10/4A","1/10/TE2",43346,"4A","GRM","SH","TE2",1,10]
["1/9/GRM","1/9/4B","1/9/TE2",43346,"4B","GRM","SH","TE2",1,9]
["1/10/GRM","1/10/4B","1/10/TE2",43346,"4B","GRM","SH","TE2",1,10]
["1/9/BAS","1/9/4A","1/9/TS1",43346,"4A","BAS","SD","TS1",1,9]
[{"$f":"CONCATENATE($I487,\"/\",$J487,\"/\",$F487)","v":"1/10/BAS"},{"$f":"CONCATENATE($I487,\"/\",$J487,\"/\",$E487)","v":"1/10/4A"},{"$f":"CONCATENATE($I487,\"/\",$J487,\"/\",$H487)","v":"1/10/TS1"},43346,"4A","BAS","SD","TS1",1,10]
["1/9/KRO","1/9/4B","1/9/THU",43346,"4B","KRO","SD","THU",1,9]
["1/10/KRO","1/10/4B","1/10/THU",43346,"4B","KRO","SD","THU",1,10]
["3/1/GRM","3/1/4A","3/1/THU",1365,"4A","GRM","SH","THU",3,1]
["3/1/GRM","3/1/4B","3/1/THU",1365,"4B","GRM","SH","THU",3,1]
["3/1/BAS","3/1/4A","3/1/THO",1365,"4A","BAS","SD","THO",3,1]
["2/9/BLA","2/9/4C","2/9/THU",43344,"4C","BLA","SH","THU",2,9]
["2/10/BLA","2/10/4C","2/10/THU",43344,"4C","BLA","SH","THU",2,10]
["2/9/BLA","2/9/4K","2/9/THU",43344,"4K","BLA","SH","THU",2,9]
["2/10/BLA","2/10/4K","2/10/THU",43344,"4K","BLA","SH","THU",2,10]
["2/9/BLA","2/9/4L","2/9/THU",43344,"4L","BLA","SH","THU",2,9]
["2/10/BLA","2/10/4L","2/10/THU",43344,"4L","BLA","SH","THU",2,10]
["2/9/BAE","2/9/4C","2/9/TS2",43344,"4C","BAE","SD","TS2",2,9]
["2/10/BAE","2/10/4C","2/10/TS2",43344,"4C","BAE","SD","TS2",2,10]
["2/9/BAE","2/9/4K","2/9/TS2",43344,"4K","BAE","SD","TS2",2,9]
["2/10/BAE","2/10/4K","2/10/TS2",43344,"4K","BAE","SD","TS2",2,10]
["2/9/KRO","2/9/4C","2/9/TE1",43344,"4C","KRO","SD","TE1",2,9]
["2/10/KRO","2/10/4C","2/10/TE1",43344,"4C","KRO","SD","TE1",2,10]
["2/9/KRO","2/9/4L","2/9/TE1",43344,"4L","KRO","SD","TE1",2,9]
["2/10/KRO","2/10/4L","2/10/TE1",43344,"4L","KRO","SD","TE1",2,10]
["5/9/BLA","5/9/4C","5/9/THU",1513,"4C","BLA","SH","THU",5,9]
["5/9/BLA","5/9/4K","5/9/THU",1513,"4K","BLA","SH","THU",5,9]
["5/9/BLA","5/9/4L","5/9/THU",1513,"4L","BLA","SH","THU",5,9]
["5/9/BAE","5/9/4C","5/9/THO",1513,"4C","BAE","SD","THO",5,9]
["5/9/BAE","5/9/4K","5/9/THO",1513,"4K","BAE","SD","THO",5,9]
["3/6/FRA","3/6/3K","3/6/THU",43352,"3K","FRA","SH","THU",3,6]
["3/6/FRA","3/6/3L","3/6/THU",43352,"3L","FRA","SH","THU",3,6]
["2/7/FRA","2/7/3K","2/7/THU",1217,"3K","FRA","SH","THU",2,7]
["2/8/FRA","2/8/3K","2/8/THU",1217,"3K","FRA","SH","THU",2,8]
["2/7/FRA","2/7/3L","2/7/THU",1217,"3L","FRA","SH","THU",2,7]
["2/8/FRA","2/8/3L","2/8/THU",1217,"3L","FRA","SH","THU",2,8]
["2/7/KRO","2/7/3L","2/7/TS1",1217,"3L","KRO","SD","TS1",2,7]
["2/8/KRO","2/8/3L","2/8/TS1",1217,"3L","KRO","SD","TS1",2,8]
["2/7/BAE","2/7/3K","2/7/TE1",1217,"3K","BAE","SD","TE1",2,7]
["2/8/BAE","2/8/3K","2/8/TE1",1217,"3K","BAE","SD","TE1",2,8]
["4/1/GRM","4/1/1A","4/1/THU",43366,"1A","GRM","SH","THU",4,1]
["4/1/GRM","4/1/1B","4/1/THU",43366,"1B","GRM","SH","THU",4,1]
["4/1/GRM","4/1/1C","4/1/THU",43366,"1C","GRM","SH","THU",4,1]
["4/1/RUT","4/1/1A","4/1/THO",43366,"1A","RUT","SD","THO",4,1]
["4/1/RUT","4/1/1C","4/1/THO",43366,"1C","RUT","SD","THO",4,1]
["1/3/GRM","1/3/1A","1/3/TS2",33,"1A","GRM","SH","TS2",1,3]
["1/4/GRM","1/4/1A","1/4/TS2",33,"1A","GRM","SH","TS2",1,4]
["1/3/GRM","1/3/1B","1/3/TS2",33,"1B","GRM","SH","TS2",1,3]
["1/4/GRM","1/4/1B","1/4/TS2",33,"1B","GRM","SH","TS2",1,4]
["1/3/GRM","1/3/1C","1/3/TS2",33,"1C","GRM","SH","TS2",1,3]
["1/4/GRM","1/4/1C","1/4/TS2",33,"1C","GRM","SH","TS2",1,4]
["1/3/BLA","1/3/1A","1/3/THU",33,"1A","BLA","SD","THU",1,3]
["1/4/BLA","1/4/1A","1/4/THU",33,"1A","BLA","SD","THU",1,4]
["1/3/BLA","1/3/1B","1/3/THU",33,"1B","BLA","SD","THU",1,3]
["1/4/BLA","1/4/1B","1/4/THU",33,"1B","BLA","SD","THU",1,4]
["1/3/RUT","1/3/1A","1/3/THO",33,"1A","RUT","SD","THO",1,3]
["1/4/RUT","1/4/1A","1/4/THO",33,"1A","RUT","SD","THO",1,4]
["1/3/RUT","1/3/1C","1/3/THO",33,"1C","RUT","SD","THO",1,3]
["1/4/RUT","1/4/1C","1/4/THO",33,"1C","RUT","SD","THO",1,4]
["2/8/HUJ","2/8/5A","2/8/119",53464,"5A","HUJ","BG",119,2,8]
["2/8/HUJ","2/8/5B","2/8/119",53464,"5B","HUJ","BG",119,2,8]
["2/8/STC","2/8/5A","2/8/122",53464,"5A","STC","BG",122,2,8]
["2/8/STC","2/8/5E","2/8/122",53464,"5E","STC","BG",122,2,8]
["2/8/SAN","2/8/5A","2/8/222",53464,"5A","SAN","MU",222,2,8]
["2/8/SAN","2/8/5B","2/8/222",53464,"5B","SAN","MU",222,2,8]
["2/8/SAN","2/8/5E","2/8/222",53464,"5E","SAN","MU",222,2,8]
["2/7/HUJ","2/7/5A","2/7/119",1872,"5A","HUJ","BG",119,2,7]
["2/7/HUJ","2/7/5B","2/7/119",1872,"5B","HUJ","BG",119,2,7]
["2/7/STC","2/7/5A","2/7/122",1872,"5A","STC","BG",122,2,7]
[{"$f":"CONCATENATE($I551,\"/\",$J551,\"/\",$F551)","v":"2/7/STC"},{"$f":"CONCATENATE($I551,\"/\",$J551,\"/\",$E551)","v":"2/7/5E"},{"$f":"CONCATENATE($I551,\"/\",$J551,\"/\",$H551)","v":"2/7/122"},1872,"5E","STC","BG",122,2,7]
["4/2/GRM","4/2/1D","4/2/THU",43362,"1D","GRM","SH","THU",4,2]
["4/2/GRM","4/2/1E","4/2/THU",43362,"1E","GRM","SH","THU",4,2]
["4/2/RUT","4/2/1D","4/2/THO",43362,"1D","RUT","SD","THO",4,2]
["4/2/RUT","4/2/1E","4/2/THO",43362,"1E","RUT","SD","THO",4,2]
["2/3/GRM","2/3/1D","2/3/THU",255,"1D","GRM","SH","THU",2,3]
["2/4/GRM","2/4/1D","2/4/THU",255,"1D","GRM","SH","THU",2,4]
["2/3/GRM","2/3/1E","2/3/THU",255,"1E","GRM","SH","THU",2,3]
["2/4/GRM","2/4/1E","2/4/THU",255,"1E","GRM","SH","THU",2,4]
["2/3/RUT","2/3/1D","2/3/TS2",255,"1D","RUT","SD","TS2",2,3]
["2/4/RUT","2/4/1D","2/4/TS2",255,"1D","RUT","SD","TS2",2,4]
["2/3/RUT","2/3/1E","2/3/TS2",255,"1E","RUT","SD","TS2",2,3]
["2/4/RUT","2/4/1E","2/4/TS2",255,"1E","RUT","SD","TS2",2,4]
["1/10/RIS","1/10/2B","1/10/143",53474,"2B","RIS","NT",143,1,10]
["1/10/RIS","1/10/2A","1/10/143",53474,"2A","RIS","NT",143,1,10]
["1/10/MEZ","1/10/2B","1/10/143",53474,"2B","MEZ","NT",143,1,10]
["1/10/MEZ","1/10/2A","1/10/143",53474,"2A","MEZ","NT",143,1,10]
["1/8/THE","1/8/2B","1/8/202",527,"2B","THE","LA",202,1,8]
["1/9/THE","1/9/2B","1/9/202",527,"2B","THE","LA",202,1,9]
["1/8/RIS","1/8/2B","1/8/143",527,"2B","RIS","NT",143,1,8]
["1/9/RIS","1/9/2B","1/9/143",527,"2B","RIS","NT",143,1,9]
["1/8/RIS","1/8/2A","1/8/143",527,"2A","RIS","NT",143,1,8]
["1/9/RIS","1/9/2A","1/9/143",527,"2A","RIS","NT",143,1,9]
["1/8/MEZ","1/8/2B","1/8/143",527,"2B","MEZ","NT",143,1,8]
["1/9/MEZ","1/9/2B","1/9/143",527,"2B","MEZ","NT",143,1,9]
["1/8/MEZ","1/8/2A","1/8/143",527,"2A","MEZ","NT",143,1,8]
["1/9/MEZ","1/9/2A","1/9/143",527,"2A","MEZ","NT",143,1,9]
["1/8/BLU","1/8/2A","1/8/204",527,"2A","BLU","LA",204,1,8]
["1/9/BLU","1/9/2A","1/9/204",527,"2A","BLU","LA",204,1,9]
["2/3/SMN","2/3/4B","2/3/119",1428,"4B","SMN","BG",119,2,3]
["2/4/SMN","2/4/4B","2/4/119",1428,"4B","SMN","BG",119,2,4]
["2/3/SMN","2/3/4D","2/3/119",1428,"4D","SMN","BG",119,2,3]
["2/4/SMN","2/4/4D","2/4/119",1428,"4D","SMN","BG",119,2,4]
["2/3/SIE","2/3/4B","2/3/U47",1428,"4B","SIE","BG","U47",2,3]
["2/4/SIE","2/4/4B","2/4/U47",1428,"4B","SIE","BG","U47",2,4]
["2/3/SIE","2/3/4G","2/3/U47",1428,"4G","SIE","BG","U47",2,3]
["2/4/SIE","2/4/4G","2/4/U47",1428,"4G","SIE","BG","U47",2,4]
["2/3/THM","2/3/4B","2/3/22",1428,"4B","THM","MU",22,2,3]
["2/4/THM","2/4/4B","2/4/22",1428,"4B","THM","MU",22,2,4]
["2/3/THM","2/3/4D","2/3/22",1428,"4D","THM","MU",22,2,3]
["2/4/THM","2/4/4D","2/4/22",1428,"4D","THM","MU",22,2,4]
["2/3/THM","2/3/4G","2/3/22",1428,"4G","THM","MU",22,2,3]
["2/4/THM","2/4/4G","2/4/22",1428,"4G","THM","MU",22,2,4]
["1/7/BLA","1/7/6A","1/7/TS2",2327,"6A","BLA","SH","TS2",1,7]
["1/8/BLA","1/8/6A","1/8/TS2",2327,"6A","BLA","SH","TS2",1,8]
["1/7/BLA","1/7/6C","1/7/TS2",2327,"6C","BLA","SH","TS2",1,7]
["1/8/BLA","1/8/6C","1/8/TS2",2327,"6C","BLA","SH","TS2",1,8]
["1/7/CAS","1/7/6A","1/7/THO",2327,"6A","CAS","SD","THO",1,7]
["1/8/CAS","1/8/6A","1/8/THO",2327,"6A","CAS","SD","THO",1,8]
["1/7/CAS","1/7/6C","1/7/THO",2327,"6C","CAS","SD","THO",1,7]
["1/8/CAS","1/8/6C","1/8/THO",2327,"6C","CAS","SD","THO",1,8]
["1/3/FRA","1/3/6B","1/3/TE1",2401,"6B","FRA","SH","TE1",1,3]
["1/4/FRA","1/4/6B","1/4/TE1",2401,"6B","FRA","SH","TE1",1,4]
["1/3/FRA","1/3/6K","1/3/TE1",2401,"6K","FRA","SH","TE1",1,3]
["1/4/FRA","1/4/6K","1/4/TE1",2401,"6K","FRA","SH","TE1",1,4]
["1/3/STS","1/3/6B","1/3/TS1",2401,"6B","STS","SD","TS1",1,3]
["1/4/STS","1/4/6B","1/4/TS1",2401,"6B","STS","SD","TS1",1,4]
["1/3/STS","1/3/6K","1/3/TS1",2401,"6K","STS","SD","TS1",1,3]
["1/4/STS","1/4/6K","1/4/TS1",2401,"6K","STS","SD","TS1",1,4]
["1/9/BLA","1/9/6D","1/9/THO",2549,"6D","BLA","SH","THO",1,9]
["1/10/BLA","1/10/6D","1/10/THO",2549,"6D","BLA","SH","THO",1,10]
["1/9/BLA","1/9/6L","1/9/THO",2549,"6L","BLA","SH","THO",1,9]
["1/10/BLA","1/10/6L","1/10/THO",2549,"6L","BLA","SH","THO",1,10]
["1/9/CAS","1/9/6D","1/9/TE1",2549,"6D","CAS","SD","TE1",1,9]
[{"$f":"CONCATENATE($I615,\"/\",$J615,\"/\",$F615)","v":"1/10/CAS"},{"$f":"CONCATENATE($I615,\"/\",$J615,\"/\",$E615)","v":"1/10/6D"},{"$f":"CONCATENATE($I615,\"/\",$J615,\"/\",$H615)","v":"1/10/TE1"},2549,"6D","CAS","SD","TE1",1,10]
["1/9/CAS","1/9/6L","1/9/TE1",2549,"6L","CAS","SD","TE1",1,9]
["1/10/CAS","1/10/6L","1/10/TE1",2549,"6L","CAS","SD","TE1",1,10]
["4/3/STA","4/3/5A","4/3/N06",1910,"5A","STA","EBI","N06",4,3]
["4/4/STA","4/4/5A","4/4/N06",1910,"5A","STA","EBI","N06",4,4]
["4/3/STA","4/3/5B","4/3/N06",1910,"5B","STA","EBI","N06",4,3]
["4/4/STA","4/4/5B","4/4/N06",1910,"5B","STA","EBI","N06",4,4]
["4/3/STA","4/3/5D","4/3/N06",1910,"5D","STA","EBI","N06",4,3]
["4/4/STA","4/4/5D","4/4/N06",1910,"5D","STA","EBI","N06",4,4]
["4/3/STA","4/3/5E","4/3/N06",1910,"5E","STA","EBI","N06",4,3]
["4/4/STA","4/4/5E","4/4/N06",1910,"5E","STA","EBI","N06",4,4]
["4/3/STA","4/3/5K","4/3/N06",1910,"5K","STA","EBI","N06",4,3]
["4/4/STA","4/4/5K","4/4/N06",1910,"5K","STA","EBI","N06",4,4]
["4/3/STA","4/3/5L","4/3/N06",1910,"5L","STA","EBI","N06",4,3]
["4/4/STA","4/4/5L","4/4/N06",1910,"5L","STA","EBI","N06",4,4]
["4/3/DIS","4/3/5A","4/3/106",1910,"5A","DIS","EGG",106,4,3]
["4/4/DIS","4/4/5A","4/4/106",1910,"5A","DIS","EGG",106,4,4]
["4/3/DIS","4/3/5B","4/3/106",1910,"5B","DIS","EGG",106,4,3]
["4/4/DIS","4/4/5B","4/4/106",1910,"5B","DIS","EGG",106,4,4]
["4/3/DIS","4/3/5D","4/3/106",1910,"5D","DIS","EGG",106,4,3]
["4/4/DIS","4/4/5D","4/4/106",1910,"5D","DIS","EGG",106,4,4]
["4/3/DIS","4/3/5E","4/3/106",1910,"5E","DIS","EGG",106,4,3]
["4/4/DIS","4/4/5E","4/4/106",1910,"5E","DIS","EGG",106,4,4]
["4/3/DIS","4/3/5K","4/3/106",1910,"5K","DIS","EGG",106,4,3]
["4/4/DIS","4/4/5K","4/4/106",1910,"5K","DIS","EGG",106,4,4]
["4/3/DIS","4/3/5L","4/3/106",1910,"5L","DIS","EGG",106,4,3]
["4/4/DIS","4/4/5L","4/4/106",1910,"5L","DIS","EGG",106,4,4]
["4/3/GHE","4/3/5A","4/3/114",1910,"5A","GHE","EIN",114,4,3]
["4/4/GHE","4/4/5A","4/4/114",1910,"5A","GHE","EIN",114,4,4]
["4/3/GHE","4/3/5B","4/3/114",1910,"5B","GHE","EIN",114,4,3]
["4/4/GHE","4/4/5B","4/4/114",1910,"5B","GHE","EIN",114,4,4]
["4/3/GHE","4/3/5D","4/3/114",1910,"5D","GHE","EIN",114,4,3]
["4/4/GHE","4/4/5D","4/4/114",1910,"5D","GHE","EIN",114,4,4]
["4/3/GHE","4/3/5E","4/3/114",1910,"5E","GHE","EIN",114,4,3]
["4/4/GHE","4/4/5E","4/4/114",1910,"5E","GHE","EIN",114,4,4]
["4/3/GHE","4/3/5K","4/3/114",1910,"5K","GHE","EIN",114,4,3]
["4/4/GHE","4/4/5K","4/4/114",1910,"5K","GHE","EIN",114,4,4]
["4/3/GHE","4/3/5L","4/3/114",1910,"5L","GHE","EIN",114,4,3]
["4/4/GHE","4/4/5L","4/4/114",1910,"5L","GHE","EIN",114,4,4]
["4/3/MAU","4/3/5A","4/3/219",1910,"5A","MAU","EPP",219,4,3]
["4/4/MAU","4/4/5A","4/4/219",1910,"5A","MAU","EPP",219,4,4]
["4/3/MAU","4/3/5B","4/3/219",1910,"5B","MAU","EPP",219,4,3]
["4/4/MAU","4/4/5B","4/4/219",1910,"5B","MAU","EPP",219,4,4]
["4/3/MAU","4/3/5D","4/3/219",1910,"5D","MAU","EPP",219,4,3]
["4/4/MAU","4/4/5D","4/4/219",1910,"5D","MAU","EPP",219,4,4]
["4/3/MAU","4/3/5E","4/3/219",1910,"5E","MAU","EPP",219,4,3]
["4/4/MAU","4/4/5E","4/4/219",1910,"5E","MAU","EPP",219,4,4]
["4/3/MAU","4/3/5K","4/3/219",1910,"5K","MAU","EPP",219,4,3]
["4/4/MAU","4/4/5K","4/4/219",1910,"5K","MAU","EPP",219,4,4]
["4/3/MAU","4/3/5L","4/3/219",1910,"5L","MAU","EPP",219,4,3]
["4/4/MAU","4/4/5L","4/4/219",1910,"5L","MAU","EPP",219,4,4]
["4/3/AMI","4/3/5A","4/3/202",1910,"5A","AMI","EPP",202,4,3]
["4/4/AMI","4/4/5A","4/4/202",1910,"5A","AMI","EPP",202,4,4]
["4/3/AMI","4/3/5B","4/3/202",1910,"5B","AMI","EPP",202,4,3]
["4/4/AMI","4/4/5B","4/4/202",1910,"5B","AMI","EPP",202,4,4]
["4/3/AMI","4/3/5D","4/3/202",1910,"5D","AMI","EPP",202,4,3]
["4/4/AMI","4/4/5D","4/4/202",1910,"5D","AMI","EPP",202,4,4]
["4/3/AMI","4/3/5E","4/3/202",1910,"5E","AMI","EPP",202,4,3]
["4/4/AMI","4/4/5E","4/4/202",1910,"5E","AMI","EPP",202,4,4]
["4/3/AMI","4/3/5K","4/3/202",1910,"5K","AMI","EPP",202,4,3]
["4/4/AMI","4/4/5K","4/4/202",1910,"5K","AMI","EPP",202,4,4]
["4/3/AMI","4/3/5L","4/3/202",1910,"5L","AMI","EPP",202,4,3]
["4/4/AMI","4/4/5L","4/4/202",1910,"5L","AMI","EPP",202,4,4]
["4/3/KUT","4/3/5A","4/3/117",1910,"5A","KUT","EWR",117,4,3]
[{"$f":"CONCATENATE($I679,\"/\",$J679,\"/\",$F679)","v":"4/4/KUT"},{"$f":"CONCATENATE($I679,\"/\",$J679,\"/\",$E679)","v":"4/4/5A"},{"$f":"CONCATENATE($I679,\"/\",$J679,\"/\",$H679)","v":"4/4/117"},1910,"5A","KUT","EWR",117,4,4]
["4/3/KUT","4/3/5B","4/3/117",1910,"5B","KUT","EWR",117,4,3]
["4/4/KUT","4/4/5B","4/4/117",1910,"5B","KUT","EWR",117,4,4]
["4/3/KUT","4/3/5D","4/3/117",1910,"5D","KUT","EWR",117,4,3]
["4/4/KUT","4/4/5D","4/4/117",1910,"5D","KUT","EWR",117,4,4]
["4/3/KUT","4/3/5E","4/3/117",1910,"5E","KUT","EWR",117,4,3]
["4/4/KUT","4/4/5E","4/4/117",1910,"5E","KUT","EWR",117,4,4]
["4/3/KUT","4/3/5K","4/3/117",1910,"5K","KUT","EWR",117,4,3]
["4/4/KUT","4/4/5K","4/4/117",1910,"5K","KUT","EWR",117,4,4]
["4/3/KUT","4/3/5L","4/3/117",1910,"5L","KUT","EWR",117,4,3]
["4/4/KUT","4/4/5L","4/4/117",1910,"5L","KUT","EWR",117,4,4]
["4/3/GRM","4/3/5A","4/3/~THU~016",1910,"5A","GRM","ESP","~THU~016",4,3]
["4/4/GRM","4/4/5A","4/4/~THU~016",1910,"5A","GRM","ESP","~THU~016",4,4]
["4/3/GRM","4/3/5B","4/3/~THU~016",1910,"5B","GRM","ESP","~THU~016",4,3]
["4/4/GRM","4/4/5B","4/4/~THU~016",1910,"5B","GRM","ESP","~THU~016",4,4]
["4/3/GRM","4/3/5D","4/3/~THU~016",1910,"5D","GRM","ESP","~THU~016",4,3]
["4/4/GRM","4/4/5D","4/4/~THU~016",1910,"5D","GRM","ESP","~THU~016",4,4]
["4/3/GRM","4/3/5E","4/3/~THU~016",1910,"5E","GRM","ESP","~THU~016",4,3]
["4/4/GRM","4/4/5E","4/4/~THU~016",1910,"5E","GRM","ESP","~THU~016",4,4]
["4/3/GRM","4/3/5K","4/3/~THU~016",1910,"5K","GRM","ESP","~THU~016",4,3]
["4/4/GRM","4/4/5K","4/4/~THU~016",1910,"5K","GRM","ESP","~THU~016",4,4]
["4/3/GRM","4/3/5L","4/3/~THU~016",1910,"5L","GRM","ESP","~THU~016",4,3]
["4/4/GRM","4/4/5L","4/4/~THU~016",1910,"5L","GRM","ESP","~THU~016",4,4]
["5/3/STU","5/3/1F","5/3/THU",43364,"1F","STU","SH","THU",5,3]
["5/3/STU","5/3/1G","5/3/THU",43364,"1G","STU","SH","THU",5,3]
["5/3/STS","5/3/1F","5/3/THO",43364,"1F","STS","SD","THO",5,3]
["5/3/STS","5/3/1G","5/3/THO",43364,"1G","STS","SD","THO",5,3]
["2/9/STU","2/9/1F","2/9/THO",403,"1F","STU","SH","THO",2,9]
["2/10/STU","2/10/1F","2/10/THO",403,"1F","STU","SH","THO",2,10]
["2/9/STU","2/9/1G","2/9/THO",403,"1G","STU","SH","THO",2,9]
["2/10/STU","2/10/1G","2/10/THO",403,"1G","STU","SH","THO",2,10]
["2/9/STS","2/9/1F","2/9/TS1",403,"1F","STS","SD","TS1",2,9]
["2/10/STS","2/10/1F","2/10/TS1",403,"1F","STS","SD","TS1",2,10]
["2/9/STS","2/9/1G","2/9/TS1",403,"1G","STS","SD","TS1",2,9]
["2/10/STS","2/10/1G","2/10/TS1",403,"1G","STS","SD","TS1",2,10]
["2/3/BLA","2/3/5A","2/3/THO",43338,"5A","BLA","SH","THO",2,3]
["2/4/BLA","2/4/5A","2/4/THO",43338,"5A","BLA","SH","THO",2,4]
["2/3/BLA","2/3/5D","2/3/THO",43338,"5D","BLA","SH","THO",2,3]
["2/4/BLA","2/4/5D","2/4/THO",43338,"5D","BLA","SH","THO",2,4]
["2/3/BAE","2/3/5A","2/3/TE1",43338,"5A","BAE","SD","TE1",2,3]
["2/4/BAE","2/4/5A","2/4/TE1",43338,"5A","BAE","SD","TE1",2,4]
["2/3/BAE","2/3/5D","2/3/TE1",43338,"5D","BAE","SD","TE1",2,3]
["2/4/BAE","2/4/5D","2/4/TE1",43338,"5D","BAE","SD","TE1",2,4]
["5/7/BLA","5/7/5A","5/7/THU",1883,"5A","BLA","SH","THU",5,7]
["5/7/BLA","5/7/5D","5/7/THU",1883,"5D","BLA","SH","THU",5,7]
["5/7/BAE","5/7/5A","5/7/THO",1883,"5A","BAE","SD","THO",5,7]
["5/7/BAE","5/7/5D","5/7/THO",1883,"5D","BAE","SD","THO",5,7]
["5/2/STU","5/2/5B","5/2/THU",43336,"5B","STU","SH","THU",5,2]
["5/2/STU","5/2/5L","5/2/THU",43336,"5L","STU","SH","THU",5,2]
["5/2/STS","5/2/5B","5/2/THO",43336,"5B","STS","SD","THO",5,2]
["5/2/STS","5/2/5L","5/2/THO",43336,"5L","STS","SD","THO",5,2]
["2/1/STU","2/1/5B","2/1/TE2",1957,"5B","STU","SH","TE2",2,1]
["2/2/STU","2/2/5B","2/2/TE2",1957,"5B","STU","SH","TE2",2,2]
["2/1/STU","2/1/5L","2/1/TE2",1957,"5L","STU","SH","TE2",2,1]
["2/2/STU","2/2/5L","2/2/TE2",1957,"5L","STU","SH","TE2",2,2]
["2/1/STS","2/1/5B","2/1/TS1",1957,"5B","STS","SD","TS1",2,1]
["2/2/STS","2/2/5B","2/2/TS1",1957,"5B","STS","SD","TS1",2,2]
["2/1/STS","2/1/5L","2/1/TS1",1957,"5L","STS","SD","TS1",2,1]
["2/2/STS","2/2/5L","2/2/TS1",1957,"5L","STS","SD","TS1",2,2]
["5/8/BLA","5/8/5E","5/8/THU",43340,"5E","BLA","SH","THU",5,8]
["5/8/BLA","5/8/5K","5/8/THU",43340,"5K","BLA","SH","THU",5,8]
["5/8/BAE","5/8/5E","5/8/THO",43340,"5E","BAE","SD","THO",5,8]
["5/8/BAE","5/8/5K","5/8/THO",43340,"5K","BAE","SD","THO",5,8]
["2/1/BLA","2/1/5E","2/1/THO",2105,"5E","BLA","SH","THO",2,1]
[{"$f":"CONCATENATE($I743,\"/\",$J743,\"/\",$F743)","v":"2/2/BLA"},{"$f":"CONCATENATE($I743,\"/\",$J743,\"/\",$E743)","v":"2/2/5E"},{"$f":"CONCATENATE($I743,\"/\",$J743,\"/\",$H743)","v":"2/2/THO"},2105,"5E","BLA","SH","THO",2,2]
["2/1/BLA","2/1/5K","2/1/THO",2105,"5K","BLA","SH","THO",2,1]
["2/2/BLA","2/2/5K","2/2/THO",2105,"5K","BLA","SH","THO",2,2]
["2/1/BAE","2/1/5E","2/1/TE1",2105,"5E","BAE","SD","TE1",2,1]
["2/2/BAE","2/2/5E","2/2/TE1",2105,"5E","BAE","SD","TE1",2,2]
["2/1/BAE","2/1/5K","2/1/TE1",2105,"5K","BAE","SD","TE1",2,1]
["2/2/BAE","2/2/5K","2/2/TE1",2105,"5K","BAE","SD","TE1",2,2]
["3/7/KRO","3/7/F4A","3/7/THU",3219,"F4A","KRO","SP","THU",3,7]
["3/8/KRO","3/8/F4A","3/8/THU",3219,"F4A","KRO","SP","THU",3,8]
["3/7/KRO","3/7/F4B","3/7/THU",3219,"F4B","KRO","SP","THU",3,7]
["3/8/KRO","3/8/F4B","3/8/THU",3219,"F4B","KRO","SP","THU",3,8]
["3/7/SIE","3/7/F4A","3/7/U45",3219,"F4A","SIE","BG","U45",3,7]
["3/8/SIE","3/8/F4A","3/8/U45",3219,"F4A","SIE","BG","U45",3,8]
["3/7/SIE","3/7/F4B","3/7/U45",3219,"F4B","SIE","BG","U45",3,7]
["3/8/SIE","3/8/F4B","3/8/U45",3219,"F4B","SIE","BG","U45",3,8]
["5/7/BRO","5/7/1A","5/7/U47",22,"1A","BRO","BG","U47",5,7]
["5/8/BRO","5/8/1A","5/8/U47",22,"1A","BRO","BG","U47",5,8]
["2/1/BRO","2/1/1A","2/1/U42",24,"1A","BRO","TG","U42",2,1]
["2/2/BRO","2/2/1A","2/2/U42",24,"1A","BRO","TG","U42",2,2]
["2/7/MEZ","2/7/1A","2/7/N07",10,"1A","MEZ","NT","N07",2,7]
["2/8/MEZ","2/8/1A","2/8/N07",10,"1A","MEZ","NT","N07",2,8]
["1/1/KOR","1/1/1A","1/1/213",2,"1A","KOR","DE",213,1,1]
["1/2/KOR","1/2/1A","1/2/213",2,"1A","KOR","DE",213,1,2]
["3/3/KOR","3/3/1A","3/3/214",2,"1A","KOR","DE",214,3,3]
["3/4/KOR","3/4/1A","3/4/214",2,"1A","KOR","DE",214,3,4]
["4/9/KOR","4/9/1A","4/9/213",2,"1A","KOR","DE",213,4,9]
["1/7/BUR","1/7/1A","1/7/17",4,"1A","BUR","EN",17,1,7]
["1/8/BUR","1/8/1A","1/8/17",4,"1A","BUR","EN",17,1,8]
["5/2/BUR","5/2/1A","5/2/18",4,"1A","BUR","EN",18,5,2]
["2/3/GRB","2/3/1A","2/3/14",3,"1A","GRB","FR",14,2,3]
["2/4/GRB","2/4/1A","2/4/14",3,"1A","GRB","FR",14,2,4]
["4/2/GRB","4/2/1A","4/2/14",3,"1A","GRB","FR",14,4,2]
["3/1/KNE","3/1/1A","3/1/115",21,"1A","KNE","GG",115,3,1]
["3/2/KNE","3/2/1A","3/2/115",21,"1A","KNE","GG",115,3,2]
["5/3/FUM","5/3/1A","5/3/202",20,"1A","FUM","GS",202,5,3]
["5/4/FUM","5/4/1A","5/4/202",20,"1A","FUM","GS",202,5,4]
["5/1/BUR","5/1/1A","5/1/18",70,"1A","BUR","KS",18,5,1]
["1/9/CON","1/9/1A","1/9/112",5,"1A","CON","MA",112,1,9]
["1/10/CON","1/10/1A","1/10/112",5,"1A","CON","MA",112,1,10]
["4/3/CON","4/3/1A","4/3/112",5,"1A","CON","MA",112,4,3]
["4/4/CON","4/4/1A","4/4/112",5,"1A","CON","MA",112,4,4]
["5/9/CON","5/9/1A","5/9/112",5,"1A","CON","MA",112,5,9]
["4/7/BEL","4/7/1A","4/7/222",26,"1A","BEL","MU",222,4,7]
["4/8/BEL","4/8/1A","4/8/222",26,"1A","BEL","MU",222,4,8]
["2/9/BRE","2/9/1A","2/9/244",31,"1A","BRE","RE",244,2,9]
["2/10/BRE","2/10/1A","2/10/244",31,"1A","BRE","RE",244,2,10]
["4/10/FUM","4/10/1A","4/10/10",67,"1A","FUM","IN",10,4,10]
["2/9/BRO","2/9/1B","2/9/U47",96,"1B","BRO","BG","U47",2,9]
["2/10/BRO","2/10/1B","2/10/U47",96,"1B","BRO","BG","U47",2,10]
["5/1/BRO","5/1/1B","5/1/U45",98,"1B","BRO","TG","U45",5,1]
["5/2/BRO","5/2/1B","5/2/U45",98,"1B","BRO","TG","U45",5,2]
["5/3/MEZ","5/3/1B","5/3/N01",84,"1B","MEZ","NT","N01",5,3]
["5/4/MEZ","5/4/1B","5/4/N01",84,"1B","MEZ","NT","N01",5,4]
["1/9/KOR","1/9/1B","1/9/219",76,"1B","KOR","DE",219,1,9]
["1/10/KOR","1/10/1B","1/10/219",76,"1B","KOR","DE",219,1,10]
["3/1/KOR","3/1/1B","3/1/214",76,"1B","KOR","DE",214,3,1]
["3/2/KOR","3/2/1B","3/2/214",76,"1B","KOR","DE",214,3,2]
["4/8/KOR","4/8/1B","4/8/213",76,"1B","KOR","DE",213,4,8]
["2/7/HAM","2/7/1B","2/7/17",78,"1B","HAM","EN",17,2,7]
["2/8/HAM","2/8/1B","2/8/17",78,"1B","HAM","EN",17,2,8]
["4/9/HAM","4/9/1B","4/9/17",78,"1B","HAM","EN",17,4,9]
["2/1/MOT","2/1/1B","2/1/217",77,"1B","MOT","FR",217,2,1]
["2/2/MOT","2/2/1B","2/2/217",77,"1B","MOT","FR",217,2,2]
["5/7/MOT","5/7/1B","5/7/217",77,"1B","MOT","FR",217,5,7]
[{"$f":"CONCATENATE($I807,\"/\",$J807,\"/\",$F807)","v":"4/2/KNE"},{"$f":"CONCATENATE($I807,\"/\",$J807,\"/\",$E807)","v":"4/2/1B"},{"$f":"CONCATENATE($I807,\"/\",$J807,\"/\",$H807)","v":"4/2/115"},95,"1B","KNE","GG",115,4,2]
["4/3/KNE","4/3/1B","4/3/115",95,"1B","KNE","GG",115,4,3]
["1/1/FUM","1/1/1B","1/1/216",94,"1B","FUM","GS",216,1,1]
["1/2/FUM","1/2/1B","1/2/216",94,"1B","FUM","GS",216,1,2]
["4/4/UNT","4/4/1B","4/4/144",144,"1B","UNT","KS",144,4,4]
["1/7/CON","1/7/1B","1/7/112",79,"1B","CON","MA",112,1,7]
["1/8/CON","1/8/1B","1/8/112",79,"1B","CON","MA",112,1,8]
["3/3/CON","3/3/1B","3/3/112",79,"1B","CON","MA",112,3,3]
["3/4/CON","3/4/1B","3/4/112",79,"1B","CON","MA",112,3,4]
["5/8/CON","5/8/1B","5/8/112",79,"1B","CON","MA",112,5,8]
["2/3/UNT","2/3/1B","2/3/222",100,"1B","UNT","MU",222,2,3]
["2/4/UNT","2/4/1B","2/4/222",100,"1B","UNT","MU",222,2,4]
["4/10/BRE","4/10/1B","4/10/244",105,"1B","BRE","RE",244,4,10]
["5/9/BRE","5/9/1B","5/9/244",105,"1B","BRE","RE",244,5,9]
["4/7/FUM","4/7/1B","4/7/10",141,"1B","FUM","IN",10,4,7]
["5/9/HUJ","5/9/1C","5/9/122",170,"1C","HUJ","BG",122,5,9]
["5/10/HUJ","5/10/1C","5/10/122",170,"1C","HUJ","BG",122,5,10]
["1/1/LUS","1/1/1C","1/1/U45",172,"1C","LUS","TG","U45",1,1]
["1/2/LUS","1/2/1C","1/2/U45",172,"1C","LUS","TG","U45",1,2]
["2/1/STA","2/1/1C","2/1/N06",158,"1C","STA","NT","N06",2,1]
["2/2/STA","2/2/1C","2/2/N06",158,"1C","STA","NT","N06",2,2]
["2/3/FRA","2/3/1C","2/3/E53",150,"1C","FRA","DE","E53",2,3]
["2/4/FRA","2/4/1C","2/4/E53",150,"1C","FRA","DE","E53",2,4]
["4/3/FRA","4/3/1C","4/3/E51",150,"1C","FRA","DE","E51",4,3]
["4/4/FRA","4/4/1C","4/4/E51",150,"1C","FRA","DE","E51",4,4]
["5/2/FRA","5/2/1C","5/2/16",150,"1C","FRA","DE",16,5,2]
["2/7/GRB","2/7/1C","2/7/14",152,"1C","GRB","EN",14,2,7]
["2/8/GRB","2/8/1C","2/8/14",152,"1C","GRB","EN",14,2,8]
["5/1/GRB","5/1/1C","5/1/14",152,"1C","GRB","EN",14,5,1]
["3/1/NEL","3/1/1C","3/1/E52",151,"1C","NEL","FR","E52",3,1]
["4/2/NEL","4/2/1C","4/2/E52",151,"1C","NEL","FR","E52",4,2]
["5/7/NEL","5/7/1C","5/7/E52",151,"1C","NEL","FR","E52",5,7]
["2/9/GRM","2/9/1C","2/9/116",169,"1C","GRM","GG",116,2,9]
["2/10/GRM","2/10/1C","2/10/116",169,"1C","GRM","GG",116,2,10]
["1/9/LIE","1/9/1C","1/9/215",168,"1C","LIE","GS",215,1,9]
["1/10/LIE","1/10/1C","1/10/215",168,"1C","LIE","GS",215,1,10]
["4/9/GRM","4/9/1C","4/9/116",218,"1C","GRM","KS",116,4,9]
["1/7/STF","1/7/1C","1/7/117",153,"1C","STF","MA",117,1,7]
["1/8/STF","1/8/1C","1/8/117",153,"1C","STF","MA",117,1,8]
["3/3/STF","3/3/1C","3/3/117",153,"1C","STF","MA",117,3,3]
["3/4/STF","3/4/1C","3/4/117",153,"1C","STF","MA",117,3,4]
["5/8/STF","5/8/1C","5/8/117",153,"1C","STF","MA",117,5,8]
["5/3/SAN","5/3/1C","5/3/222",174,"1C","SAN","MU",222,5,3]
["5/4/SAN","5/4/1C","5/4/222",174,"1C","SAN","MU",222,5,4]
["3/2/RER","3/2/1C","3/2/245",179,"1C","RER","RE",245,3,2]
["4/7/RER","4/7/1C","4/7/245",179,"1C","RER","RE",245,4,7]
["4/8/FUM","4/8/1C","4/8/10",215,"1C","FUM","IN",10,4,8]
["3/1/HUJ","3/1/1D","3/1/122",244,"1D","HUJ","BG",122,3,1]
["3/2/HUJ","3/2/1D","3/2/122",244,"1D","HUJ","BG",122,3,2]
["1/9/LUS","1/9/1D","1/9/U45",246,"1D","LUS","TG","U45",1,9]
["1/10/LUS","1/10/1D","1/10/U45",246,"1D","LUS","TG","U45",1,10]
["5/7/STA","5/7/1D","5/7/N06",232,"1D","STA","NT","N06",5,7]
["5/8/STA","5/8/1D","5/8/N06",232,"1D","STA","NT","N06",5,8]
["3/4/BLA","3/4/1D","3/4/206",224,"1D","BLA","DE",206,3,4]
["4/3/BLA","4/3/1D","4/3/215",224,"1D","BLA","DE",215,4,3]
["4/4/BLA","4/4/1D","4/4/215",224,"1D","BLA","DE",215,4,4]
["5/1/BLA","5/1/1D","5/1/215",224,"1D","BLA","DE",215,5,1]
["5/2/BLA","5/2/1D","5/2/215",224,"1D","BLA","DE",215,5,2]
["2/9/GRB","2/9/1D","2/9/14",226,"1D","GRB","EN",14,2,9]
["2/10/GRB","2/10/1D","2/10/14",226,"1D","GRB","EN",14,2,10]
["5/4/GRB","5/4/1D","5/4/14",226,"1D","GRB","EN",14,5,4]
["2/2/NEL","2/2/1D","2/2/E52",225,"1D","NEL","FR","E52",2,2]
["4/1/NEL","4/1/1D","4/1/E52",225,"1D","NEL","FR","E52",4,1]
["4/7/NEL","4/7/1D","4/7/E52",225,"1D","NEL","FR","E52",4,7]
[{"$f":"CONCATENATE($I871,\"/\",$J871,\"/\",$F871)","v":"2/7/GRM"},{"$f":"CONCATENATE($I871,\"/\",$J871,\"/\",$E871)","v":"2/7/1D"},{"$f":"CONCATENATE($I871,\"/\",$J871,\"/\",$H871)","v":"2/7/116"},243,"1D","GRM","GG",116,2,7]
["2/8/GRM","2/8/1D","2/8/116",243,"1D","GRM","GG",116,2,8]
["1/7/LIE","1/7/1D","1/7/215",242,"1D","LIE","GS",215,1,7]
["1/8/LIE","1/8/1D","1/8/215",242,"1D","LIE","GS",215,1,8]
["5/3/BLA","5/3/1D","5/3/215",292,"1D","BLA","KS",215,5,3]
["1/1/WID","1/1/1D","1/1/144",227,"1D","WID","MA",144,1,1]
["1/2/WID","1/2/1D","1/2/144",227,"1D","WID","MA",144,1,2]
["3/3/WID","3/3/1D","3/3/144",227,"1D","WID","MA",144,3,3]
["5/9/WID","5/9/1D","5/9/144",227,"1D","WID","MA",144,5,9]
["5/10/WID","5/10/1D","5/10/144",227,"1D","WID","MA",144,5,10]
["1/3/SAN","1/3/1D","1/3/222",248,"1D","SAN","MU",222,1,3]
["1/4/SAN","1/4/1D","1/4/222",248,"1D","SAN","MU",222,1,4]
["2/1/RER","2/1/1D","2/1/245",253,"1D","RER","RE",245,2,1]
["4/8/RER","4/8/1D","4/8/245",253,"1D","RER","RE",245,4,8]
["4/9/FUM","4/9/1D","4/9/10",289,"1D","FUM","IN",10,4,9]
["5/3/STC","5/3/1E","5/3/122",318,"1E","STC","BG",122,5,3]
["5/4/STC","5/4/1E","5/4/122",318,"1E","STC","BG",122,5,4]
["2/9/STC","2/9/1E","2/9/U45",320,"1E","STC","TG","U45",2,9]
["2/10/STC","2/10/1E","2/10/U45",320,"1E","STC","TG","U45",2,10]
["1/7/STU","1/7/1E","1/7/N01",306,"1E","STU","NT","N01",1,7]
["1/8/STU","1/8/1E","1/8/N01",306,"1E","STU","NT","N01",1,8]
["1/9/BRN","1/9/1E","1/9/216",298,"1E","BRN","DE",216,1,9]
["1/10/BRN","1/10/1E","1/10/216",298,"1E","BRN","DE",216,1,10]
["2/7/BRN","2/7/1E","2/7/216",298,"1E","BRN","DE",216,2,7]
["4/7/BRN","4/7/1E","4/7/216",298,"1E","BRN","DE",216,4,7]
["4/8/BRN","4/8/1E","4/8/216",298,"1E","BRN","DE",216,4,8]
["1/3/KUR","1/3/1E","1/3/13",300,"1E","KUR","EN",13,1,3]
["1/4/KUR","1/4/1E","1/4/13",300,"1E","KUR","EN",13,1,4]
["4/1/KUR","4/1/1E","4/1/13",300,"1E","KUR","EN",13,4,1]
["3/2/FIS","3/2/1E","3/2/203",299,"1E","FIS","FR",203,3,2]
["5/8/FIS","5/8/1E","5/8/203",299,"1E","FIS","FR",203,5,8]
["5/9/FIS","5/9/1E","5/9/203",299,"1E","FIS","FR",203,5,9]
["5/1/KNE","5/1/1E","5/1/115",317,"1E","KNE","GG",115,5,1]
["5/2/KNE","5/2/1E","5/2/115",317,"1E","KNE","GG",115,5,2]
["3/3/FIR","3/3/1E","3/3/216",316,"1E","FIR","GS",216,3,3]
["3/4/FIR","3/4/1E","3/4/216",316,"1E","FIR","GS",216,3,4]
["2/8/WEY","2/8/1E","2/8/113",366,"1E","WEY","KS",113,2,8]
["1/1/WEY","1/1/1E","1/1/114",301,"1E","WEY","MA",114,1,1]
["1/2/WEY","1/2/1E","1/2/114",301,"1E","WEY","MA",114,1,2]
["4/9/WEY","4/9/1E","4/9/114",301,"1E","WEY","MA",114,4,9]
["4/10/WEY","4/10/1E","4/10/114",301,"1E","WEY","MA",114,4,10]
["5/7/WEY","5/7/1E","5/7/114",301,"1E","WEY","MA",114,5,7]
["2/1/UNT","2/1/1E","2/1/222",322,"1E","UNT","MU",222,2,1]
["2/2/UNT","2/2/1E","2/2/222",322,"1E","UNT","MU",222,2,2]
["3/1/RER","3/1/1E","3/1/245",327,"1E","RER","RE",245,3,1]
["4/3/RER","4/3/1E","4/3/245",327,"1E","RER","RE",245,4,3]
["4/4/GUT","4/4/1E","4/4/10",363,"1E","GUT","IN",10,4,4]
["1/1/SIE","1/1/1F","1/1/U47",392,"1F","SIE","BG","U47",1,1]
["1/2/SIE","1/2/1F","1/2/U47",392,"1F","SIE","BG","U47",1,2]
["4/1/SIE","4/1/1F","4/1/U45",394,"1F","SIE","TG","U45",4,1]
["4/2/SIE","4/2/1F","4/2/U45",394,"1F","SIE","TG","U45",4,2]
["4/7/STU","4/7/1F","4/7/N02",380,"1F","STU","NT","N02",4,7]
["4/8/STU","4/8/1F","4/8/N02",380,"1F","STU","NT","N02",4,8]
["1/7/BRN","1/7/1F","1/7/216",372,"1F","BRN","DE",216,1,7]
["1/8/BRN","1/8/1F","1/8/216",372,"1F","BRN","DE",216,1,8]
["2/1/BRN","2/1/1F","2/1/216",372,"1F","BRN","DE",216,2,1]
["4/9/BRN","4/9/1F","4/9/216",372,"1F","BRN","DE",216,4,9]
["4/10/BRN","4/10/1F","4/10/216",372,"1F","BRN","DE",216,4,10]
["4/4/KUR","4/4/1F","4/4/13",374,"1F","KUR","EN",13,4,4]
["5/1/KUR","5/1/1F","5/1/13",374,"1F","KUR","EN",13,5,1]
["5/2/KUR","5/2/1F","5/2/13",374,"1F","KUR","EN",13,5,2]
["2/7/FIS","2/7/1F","2/7/203",373,"1F","FIS","FR",203,2,7]
["2/8/FIS","2/8/1F","2/8/203",373,"1F","FIS","FR",203,2,8]
["5/7/FIS","5/7/1F","5/7/203",373,"1F","FIS","FR",203,5,7]
[{"$f":"CONCATENATE($I935,\"/\",$J935,\"/\",$F935)","v":"3/3/KNE"},{"$f":"CONCATENATE($I935,\"/\",$J935,\"/\",$E935)","v":"3/3/1F"},{"$f":"CONCATENATE($I935,\"/\",$J935,\"/\",$H935)","v":"3/3/115"},391,"1F","KNE","GG",115,3,3]
["3/4/KNE","3/4/1F","3/4/115",391,"1F","KNE","GG",115,3,4]
["5/9/FIR","5/9/1F","5/9/218",390,"1F","FIR","GS",218,5,9]
["5/10/FIR","5/10/1F","5/10/218",390,"1F","FIR","GS",218,5,10]
["1/9/STU","1/9/1F","1/9/N01",440,"1F","STU","KS","N01",1,9]
["1/3/WEY","1/3/1F","1/3/114",375,"1F","WEY","MA",114,1,3]
["1/4/WEY","1/4/1F","1/4/114",375,"1F","WEY","MA",114,1,4]
["2/3/WEY","2/3/1F","2/3/114",375,"1F","WEY","MA",114,2,3]
["2/4/WEY","2/4/1F","2/4/114",375,"1F","WEY","MA",114,2,4]
["5/8/WEY","5/8/1F","5/8/114",375,"1F","WEY","MA",114,5,8]
["3/1/BEL","3/1/1F","3/1/222",396,"1F","BEL","MU",222,3,1]
["3/2/BEL","3/2/1F","3/2/222",396,"1F","BEL","MU",222,3,2]
["2/2/RER","2/2/1F","2/2/245",401,"1F","RER","RE",245,2,2]
["5/4/RER","5/4/1F","5/4/245",401,"1F","RER","RE",245,5,4]
["4/3/GUT","4/3/1F","4/3/10",437,"1F","GUT","IN",10,4,3]
["2/1/STC","2/1/1G","2/1/U45",466,"1G","STC","BG","U45",2,1]
["2/2/STC","2/2/1G","2/2/U45",466,"1G","STC","BG","U45",2,2]
["4/9/STC","4/9/1G","4/9/U45",468,"1G","STC","TG","U45",4,9]
["4/10/STC","4/10/1G","4/10/U45",468,"1G","STC","TG","U45",4,10]
["5/7/STU","5/7/1G","5/7/N01",454,"1G","STU","NT","N01",5,7]
["5/8/STU","5/8/1G","5/8/N01",454,"1G","STU","NT","N01",5,8]
["1/1/FRA","1/1/1G","1/1/E52",446,"1G","FRA","DE","E52",1,1]
["1/2/FRA","1/2/1G","1/2/E52",446,"1G","FRA","DE","E52",1,2]
["3/3/FRA","3/3/1G","3/3/E53",446,"1G","FRA","DE","E53",3,3]
["3/4/FRA","3/4/1G","3/4/E53",446,"1G","FRA","DE","E53",3,4]
["5/4/FRA","5/4/1G","5/4/16",446,"1G","FRA","DE",16,5,4]
["1/3/LOU","1/3/1G","1/3/15",448,"1G","LOU","EN",15,1,3]
["1/4/LOU","1/4/1G","1/4/15",448,"1G","LOU","EN",15,1,4]
["5/10/LOU","5/10/1G","5/10/15",448,"1G","LOU","EN",15,5,10]
["2/3/SPE","2/3/1G","2/3/E51",447,"1G","SPE","FR","E51",2,3]
["2/4/SPE","2/4/1G","2/4/E51",447,"1G","SPE","FR","E51",2,4]
["5/9/SPE","5/9/1G","5/9/E51",447,"1G","SPE","FR","E51",5,9]
["4/3/LUN","4/3/1G","4/3/103",465,"1G","LUN","GG",103,4,3]
["4/4/LUN","4/4/1G","4/4/103",465,"1G","LUN","GG",103,4,4]
["3/1/FIR","3/1/1G","3/1/216",464,"1G","FIR","GS",216,3,1]
["3/2/FIR","3/2/1G","3/2/216",464,"1G","FIR","GS",216,3,2]
["4/1/GUT","4/1/1G","4/1/14",514,"1G","GUT","KS",14,4,1]
["1/9/WEY","1/9/1G","1/9/114",449,"1G","WEY","MA",114,1,9]
["4/7/WEY","4/7/1G","4/7/114",449,"1G","WEY","MA",114,4,7]
["4/8/WEY","4/8/1G","4/8/114",449,"1G","WEY","MA",114,4,8]
["5/1/WEY","5/1/1G","5/1/114",449,"1G","WEY","MA",114,5,1]
["5/2/WEY","5/2/1G","5/2/114",449,"1G","WEY","MA",114,5,2]
["2/7/GUT","2/7/1G","2/7/22",470,"1G","GUT","MU",22,2,7]
["2/8/GUT","2/8/1G","2/8/22",470,"1G","GUT","MU",22,2,8]
["1/7/SWE","1/7/1G","1/7/243",475,"1G","SWE","RE",243,1,7]
["1/8/SWE","1/8/1G","1/8/243",475,"1G","SWE","RE",243,1,8]
["4/2/GUT","4/2/1G","4/2/10",511,"1G","GUT","IN",10,4,2]
["3/1/STC","3/1/2A","3/1/119",540,"2A","STC","BG",119,3,1]
["3/2/STC","3/2/2A","3/2/119",540,"2A","STC","BG",119,3,2]
["1/3/ISE","1/3/2A","1/3/N02",528,"2A","ISE","NL","N02",1,3]
["1/4/ISE","1/4/2A","1/4/N02",528,"2A","ISE","NL","N02",1,4]
["2/2/CLE","2/2/2A","2/2/214",520,"2A","CLE","DE",214,2,2]
["4/3/CLE","4/3/2A","4/3/214",520,"2A","CLE","DE",214,4,3]
["4/4/CLE","4/4/2A","4/4/214",520,"2A","CLE","DE",214,4,4]
["5/2/CLE","5/2/2A","5/2/214",520,"2A","CLE","DE",214,5,2]
["2/1/HAM","2/1/2A","2/1/17",522,"2A","HAM","EN",17,2,1]
["4/7/HAM","4/7/2A","4/7/17",522,"2A","HAM","EN",17,4,7]
["4/8/HAM","4/8/2A","4/8/17",522,"2A","HAM","EN",17,4,8]
["2/3/NEL","2/3/2A","2/3/E52",521,"2A","NEL","FR","E52",2,3]
["4/9/NEL","4/9/2A","4/9/E52",521,"2A","NEL","FR","E52",4,9]
["4/10/NEL","4/10/2A","4/10/E52",521,"2A","NEL","FR","E52",4,10]
["5/7/LUN","5/7/2A","5/7/103",539,"2A","LUN","GG",103,5,7]
["5/8/LUN","5/8/2A","5/8/103",539,"2A","LUN","GG",103,5,8]
["5/9/HAU","5/9/2A","5/9/219",538,"2A","HAU","GS",219,5,9]
[{"$f":"CONCATENATE($I999,\"/\",$J999,\"/\",$F999)","v":"5/10/HAU"},{"$f":"CONCATENATE($I999,\"/\",$J999,\"/\",$E999)","v":"5/10/2A"},{"$f":"CONCATENATE($I999,\"/\",$J999,\"/\",$H999)","v":"5/10/219"},538,"2A","HAU","GS",219,5,10]
["2/9/BAU","2/9/2A","2/9/U22",43394,"2A","BAU","HW","U22",2,9]
["2/10/BAU","2/10/2A","2/10/U22",43394,"2A","BAU","HW","U22",2,10]
["2/7/BAU","2/7/2A","2/7/U22",556,"2A","BAU","HW","U22",2,7]
["2/8/BAU","2/8/2A","2/8/U22",556,"2A","BAU","HW","U22",2,8]
["2/7/GEU","2/7/2A","2/7/10",556,"2A","GEU","IN",10,2,7]
["2/8/GEU","2/8/2A","2/8/10",556,"2A","GEU","IN",10,2,8]
["2/4/STC","2/4/2A","2/4/144",588,"2A","STC","KS",144,2,4]
["3/3/CAS","3/3/2A","3/3/143",523,"2A","CAS","MA",143,3,3]
["3/4/CAS","3/4/2A","3/4/143",523,"2A","CAS","MA",143,3,4]
["5/3/CAS","5/3/2A","5/3/118",523,"2A","CAS","MA",118,5,3]
["5/4/CAS","5/4/2A","5/4/118",523,"2A","CAS","MA",118,5,4]
["4/1/THM","4/1/2A","4/1/22",544,"2A","THM","MU",22,4,1]
["4/2/THM","4/2/2A","4/2/22",544,"2A","THM","MU",22,4,2]
["1/7/RER","1/7/2A","1/7/245",549,"2A","RER","RE",245,1,7]
["3/3/SIE","3/3/2B","3/3/U47",614,"2B","SIE","BG","U47",3,3]
["3/4/SIE","3/4/2B","3/4/U47",614,"2B","SIE","BG","U47",3,4]
["2/7/ISE","2/7/2B","2/7/N02",602,"2B","ISE","NL","N02",2,7]
["2/8/ISE","2/8/2B","2/8/N02",602,"2B","ISE","NL","N02",2,8]
["1/7/CLE","1/7/2B","1/7/214",594,"2B","CLE","DE",214,1,7]
["2/3/CLE","2/3/2B","2/3/214",594,"2B","CLE","DE",214,2,3]
["2/4/CLE","2/4/2B","2/4/214",594,"2B","CLE","DE",214,2,4]
["4/9/CLE","4/9/2B","4/9/214",594,"2B","CLE","DE",214,4,9]
["2/2/HAM","2/2/2B","2/2/17",596,"2B","HAM","EN",17,2,2]
["4/3/HAM","4/3/2B","4/3/17",596,"2B","HAM","EN",17,4,3]
["4/4/HAM","4/4/2B","4/4/17",596,"2B","HAM","EN",17,4,4]
["2/1/NEL","2/1/2B","2/1/E52",595,"2B","NEL","FR","E52",2,1]
["5/3/NEL","5/3/2B","5/3/E52",595,"2B","NEL","FR","E52",5,3]
["5/4/NEL","5/4/2B","5/4/E52",595,"2B","NEL","FR","E52",5,4]
["4/7/LUN","4/7/2B","4/7/103",613,"2B","LUN","GG",103,4,7]
["4/8/LUN","4/8/2B","4/8/103",613,"2B","LUN","GG",103,4,8]
["2/9/HAU","2/9/2B","2/9/219",612,"2B","HAU","GS",219,2,9]
["2/10/HAU","2/10/2B","2/10/219",612,"2B","HAU","GS",219,2,10]
["5/9/BAU","5/9/2B","5/9/U22",43402,"2B","BAU","HW","U22",5,9]
["5/10/BAU","5/10/2B","5/10/U22",43402,"2B","BAU","HW","U22",5,10]
["5/9/GLA","5/9/2B","5/9/U22",43402,"2B","GLA","HW","U22",5,9]
["5/10/GLA","5/10/2B","5/10/U22",43402,"2B","GLA","HW","U22",5,10]
["5/7/BAU","5/7/2B","5/7/U22",630,"2B","BAU","HW","U22",5,7]
["5/8/BAU","5/8/2B","5/8/U22",630,"2B","BAU","HW","U22",5,8]
["5/7/GLA","5/7/2B","5/7/U22",630,"2B","GLA","HW","U22",5,7]
["5/8/GLA","5/8/2B","5/8/U22",630,"2B","GLA","HW","U22",5,8]
["5/7/GHE","5/7/2B","5/7/10",630,"2B","GHE","IN",10,5,7]
["5/8/GHE","5/8/2B","5/8/10",630,"2B","GHE","IN",10,5,8]
["4/5/LUN","4/5/2B","4/5/103",662,"2B","LUN","KS",103,4,5]
["1/3/CAS","1/3/2B","1/3/118",597,"2B","CAS","MA",118,1,3]
["1/4/CAS","1/4/2B","1/4/118",597,"2B","CAS","MA",118,1,4]
["3/1/CAS","3/1/2B","3/1/143",597,"2B","CAS","MA",143,3,1]
["3/2/CAS","3/2/2B","3/2/143",597,"2B","CAS","MA",143,3,2]
["4/1/BEL","4/1/2B","4/1/119",618,"2B","BEL","MU",119,4,1]
["4/2/BEL","4/2/2B","4/2/119",618,"2B","BEL","MU",119,4,2]
["5/2/RER","5/2/2B","5/2/245",623,"2B","RER","RE",245,5,2]
["4/1/HUJ","4/1/2C","4/1/122",688,"2C","HUJ","BG",122,4,1]
["4/2/HUJ","4/2/2C","4/2/122",688,"2C","HUJ","BG",122,4,2]
["1/3/LUM","1/3/2C","1/3/N07",676,"2C","LUM","NL","N07",1,3]
["1/4/LUM","1/4/2C","1/4/N07",676,"2C","LUM","NL","N07",1,4]
["1/1/HAU","1/1/2C","1/1/219",668,"2C","HAU","DE",219,1,1]
["1/2/HAU","1/2/2C","1/2/219",668,"2C","HAU","DE",219,1,2]
["5/1/HAU","5/1/2C","5/1/219",668,"2C","HAU","DE",219,5,1]
["5/2/HAU","5/2/2C","5/2/219",668,"2C","HAU","DE",219,5,2]
["1/7/BUA","1/7/2C","1/7/16",670,"2C","BUA","EN",16,1,7]
["1/8/BUA","1/8/2C","1/8/16",670,"2C","BUA","EN",16,1,8]
["3/1/BUA","3/1/2C","3/1/16",670,"2C","BUA","EN",16,3,1]
["2/7/MOT","2/7/2C","2/7/217",669,"2C","MOT","FR",217,2,7]
["2/8/MOT","2/8/2C","2/8/217",669,"2C","MOT","FR",217,2,8]
[{"$f":"CONCATENATE($I1063,\"/\",$J1063,\"/\",$F1063)","v":"4/3/MOT"},{"$f":"CONCATENATE($I1063,\"/\",$J1063,\"/\",$E1063)","v":"4/3/2C"},{"$f":"CONCATENATE($I1063,\"/\",$J1063,\"/\",$H1063)","v":"4/3/217"},669,"2C","MOT","FR",217,4,3]
["2/9/LUN","2/9/2C","2/9/103",687,"2C","LUN","GG",103,2,9]
["2/10/LUN","2/10/2C","2/10/103",687,"2C","LUN","GG",103,2,10]
["1/9/KNE","1/9/2C","1/9/115",686,"2C","KNE","GS",115,1,9]
["1/10/KNE","1/10/2C","1/10/115",686,"2C","KNE","GS",115,1,10]
["4/9/GLA","4/9/2C","4/9/U22",43400,"2C","GLA","HW","U22",4,9]
["4/10/GLA","4/10/2C","4/10/U22",43400,"2C","GLA","HW","U22",4,10]
["4/7/GLA","4/7/2C","4/7/U22",704,"2C","GLA","HW","U22",4,7]
["4/8/GLA","4/8/2C","4/8/U22",704,"2C","GLA","HW","U22",4,8]
["4/7/GEU","4/7/2C","4/7/N10",704,"2C","GEU","IN","N10",4,7]
["4/8/GEU","4/8/2C","4/8/N10",704,"2C","GEU","IN","N10",4,8]
["5/3/HUJ","5/3/2C","5/3/114",736,"2C","HUJ","KS",114,5,3]
["2/1/RIS","2/1/2C","2/1/143",671,"2C","RIS","MA",143,2,1]
["2/2/RIS","2/2/2C","2/2/143",671,"2C","RIS","MA",143,2,2]
["5/7/RIS","5/7/2C","5/7/143",671,"2C","RIS","MA",143,5,7]
["5/8/RIS","5/8/2C","5/8/143",671,"2C","RIS","MA",143,5,8]
["5/9/UNT","5/9/2C","5/9/222",692,"2C","UNT","MU",222,5,9]
["5/10/UNT","5/10/2C","5/10/222",692,"2C","UNT","MU",222,5,10]
["3/2/RUT","3/2/2C","3/2/114",674,"2C","RUT","NT",114,3,2]
["3/3/RUT","3/3/2C","3/3/114",674,"2C","RUT","NT",114,3,3]
["3/4/RUT","3/4/2C","3/4/114",674,"2C","RUT","NT",114,3,4]
["3/2/DIN","3/2/2C","3/2/114",674,"2C","DIN","NT",114,3,2]
["3/3/DIN","3/3/2C","3/3/114",674,"2C","DIN","NT",114,3,3]
["3/4/DIN","3/4/2C","3/4/114",674,"2C","DIN","NT",114,3,4]
["4/4/RER","4/4/2C","4/4/245",697,"2C","RER","RE",245,4,4]
["2/7/SMN","2/7/2D","2/7/U47",762,"2D","SMN","BG","U47",2,7]
["2/8/SMN","2/8/2D","2/8/U47",762,"2D","SMN","BG","U47",2,8]
["5/9/STU","5/9/2D","5/9/N01",750,"2D","STU","NL","N01",5,9]
["5/10/STU","5/10/2D","5/10/N01",750,"2D","STU","NL","N01",5,10]
["1/9/FRA","1/9/2D","1/9/E52",742,"2D","FRA","DE","E52",1,9]
["1/10/FRA","1/10/2D","1/10/E52",742,"2D","FRA","DE","E52",1,10]
["2/1/FRA","2/1/2D","2/1/E53",742,"2D","FRA","DE","E53",2,1]
["2/2/FRA","2/2/2D","2/2/E53",742,"2D","FRA","DE","E53",2,2]
["1/1/LOU","1/1/2D","1/1/15",744,"2D","LOU","EN",15,1,1]
["4/9/LOU","4/9/2D","4/9/15",744,"2D","LOU","EN",15,4,9]
["4/10/LOU","4/10/2D","4/10/15",744,"2D","LOU","EN",15,4,10]
["1/7/FIS","1/7/2D","1/7/203",743,"2D","FIS","FR",203,1,7]
["1/8/FIS","1/8/2D","1/8/203",743,"2D","FIS","FR",203,1,8]
["2/9/FIS","2/9/2D","2/9/203",743,"2D","FIS","FR",203,2,9]
["5/7/KNE","5/7/2D","5/7/115",761,"2D","KNE","GG",115,5,7]
["5/8/KNE","5/8/2D","5/8/115",761,"2D","KNE","GG",115,5,8]
["4/7/KNE","4/7/2D","4/7/115",760,"2D","KNE","GS",115,4,7]
["4/8/KNE","4/8/2D","4/8/115",760,"2D","KNE","GS",115,4,8]
["4/3/GLA","4/3/2D","4/3/U22",43398,"2D","GLA","HW","U22",4,3]
["4/4/GLA","4/4/2D","4/4/U22",43398,"2D","GLA","HW","U22",4,4]
["4/3/GEU","4/3/2D","4/3/N10",43398,"2D","GEU","IN","N10",4,3]
["4/4/GEU","4/4/2D","4/4/N10",43398,"2D","GEU","IN","N10",4,4]
["4/1/GLA","4/1/2D","4/1/U22",778,"2D","GLA","HW","U22",4,1]
["4/2/GLA","4/2/2D","4/2/U22",778,"2D","GLA","HW","U22",4,2]
["2/10/FIS","2/10/2D","2/10/203",810,"2D","FIS","KS",203,2,10]
["3/1/BAE","3/1/2D","3/1/113",745,"2D","BAE","MA",113,3,1]
["3/2/BAE","3/2/2D","3/2/113",745,"2D","BAE","MA",113,3,2]
["5/1/BAE","5/1/2D","5/1/113",745,"2D","BAE","MA",113,5,1]
["5/2/BAE","5/2/2D","5/2/113",745,"2D","BAE","MA",113,5,2]
["3/3/THM","3/3/2D","3/3/22",766,"2D","THM","MU",22,3,3]
["3/4/THM","3/4/2D","3/4/22",766,"2D","THM","MU",22,3,4]
["1/2/RIS","1/2/2D","1/2/143",748,"2D","RIS","NT",143,1,2]
["1/3/RIS","1/3/2D","1/3/143",748,"2D","RIS","NT",143,1,3]
["1/4/RIS","1/4/2D","1/4/143",748,"2D","RIS","NT",143,1,4]
["1/2/MEZ","1/2/2D","1/2/143",748,"2D","MEZ","NT",143,1,2]
["1/3/MEZ","1/3/2D","1/3/143",748,"2D","MEZ","NT",143,1,3]
["1/4/MEZ","1/4/2D","1/4/143",748,"2D","MEZ","NT",143,1,4]
["5/3/RER","5/3/2D","5/3/245",771,"2D","RER","RE",245,5,3]
["1/3/SIE","1/3/2E","1/3/U47",836,"2E","SIE","BG","U47",1,3]
[{"$f":"CONCATENATE($I1127,\"/\",$J1127,\"/\",$F1127)","v":"1/4/SIE"},{"$f":"CONCATENATE($I1127,\"/\",$J1127,\"/\",$E1127)","v":"1/4/2E"},{"$f":"CONCATENATE($I1127,\"/\",$J1127,\"/\",$H1127)","v":"1/4/U47"},836,"2E","SIE","BG","U47",1,4]
["2/7/STU","2/7/2E","2/7/N06",824,"2E","STU","NL","N06",2,7]
["2/8/STU","2/8/2E","2/8/N06",824,"2E","STU","NL","N06",2,8]
["1/9/BUD","1/9/2E","1/9/18",816,"2E","BUD","DE",18,1,9]
["1/10/BUD","1/10/2E","1/10/18",816,"2E","BUD","DE",18,1,10]
["3/1/BUD","3/1/2E","3/1/18",816,"2E","BUD","DE",18,3,1]
["3/2/BUD","3/2/2E","3/2/18",816,"2E","BUD","DE",18,3,2]
["4/4/LOU","4/4/2E","4/4/15",818,"2E","LOU","EN",15,4,4]
["5/7/LOU","5/7/2E","5/7/15",818,"2E","LOU","EN",15,5,7]
["5/8/LOU","5/8/2E","5/8/15",818,"2E","LOU","EN",15,5,8]
["4/7/ERX","4/7/2E","4/7/E53",817,"2E","ERX","FR","E53",4,7]
["4/8/ERX","4/8/2E","4/8/E53",817,"2E","ERX","FR","E53",4,8]
["5/2/ERX","5/2/2E","5/2/E53",817,"2E","ERX","FR","E53",5,2]
["5/9/KNE","5/9/2E","5/9/115",835,"2E","KNE","GG",115,5,9]
["5/10/KNE","5/10/2E","5/10/115",835,"2E","KNE","GG",115,5,10]
["2/9/KNE","2/9/2E","2/9/115",834,"2E","KNE","GS",115,2,9]
["2/10/KNE","2/10/2E","2/10/115",834,"2E","KNE","GS",115,2,10]
["2/3/BAU","2/3/2E","2/3/U22",43396,"2E","BAU","HW","U22",2,3]
["2/4/BAU","2/4/2E","2/4/U22",43396,"2E","BAU","HW","U22",2,4]
["2/3/GHE","2/3/2E","2/3/10",43396,"2E","GHE","IN",10,2,3]
["2/4/GHE","2/4/2E","2/4/10",43396,"2E","GHE","IN",10,2,4]
["2/1/BAU","2/1/2E","2/1/U22",852,"2E","BAU","HW","U22",2,1]
["2/2/BAU","2/2/2E","2/2/U22",852,"2E","BAU","HW","U22",2,2]
["1/6/RER","1/6/2E","1/6/245",884,"2E","RER","KS",245,1,6]
["1/7/BAE","1/7/2E","1/7/113",819,"2E","BAE","MA",113,1,7]
["1/8/BAE","1/8/2E","1/8/113",819,"2E","BAE","MA",113,1,8]
["3/3/BAE","3/3/2E","3/3/113",819,"2E","BAE","MA",113,3,3]
["3/4/BAE","3/4/2E","3/4/113",819,"2E","BAE","MA",113,3,4]
["5/3/UNT","5/3/2E","5/3/22",840,"2E","UNT","MU",22,5,3]
["5/4/UNT","5/4/2E","5/4/22",840,"2E","UNT","MU",22,5,4]
["4/1/BRG","4/1/2E","4/1/N12",822,"2E","BRG","NT","N12",4,1]
["4/2/BRG","4/2/2E","4/2/N12",822,"2E","BRG","NT","N12",4,2]
["4/3/BRG","4/3/2E","4/3/N12",822,"2E","BRG","NT","N12",4,3]
["4/1/STU","4/1/2E","4/1/110",822,"2E","STU","NT",110,4,1]
["4/2/STU","4/2/2E","4/2/110",822,"2E","STU","NT",110,4,2]
["4/3/STU","4/3/2E","4/3/110",822,"2E","STU","NT",110,4,3]
["4/9/RER","4/9/2E","4/9/245",845,"2E","RER","RE",245,4,9]
["4/1/SMN","4/1/3A","4/1/U47",910,"3A","SMN","BG","U47",4,1]
["4/2/SMN","4/2/3A","4/2/U47",910,"3A","SMN","BG","U47",4,2]
["2/3/WER","2/3/3A","2/3/N01",899,"3A","WER","BI","N01",2,3]
["2/4/WER","2/4/3A","2/4/N01",899,"3A","WER","BI","N01",2,4]
["2/7/WER","2/7/3A","2/7/N01",900,"3A","WER","BP","N01",2,7]
["2/8/WER","2/8/3A","2/8/N01",900,"3A","WER","BP","N01",2,8]
["5/1/HAN","5/1/3A","5/1/N17",902,"3A","HAN","CH","N17",5,1]
["5/2/HAN","5/2/3A","5/2/N17",902,"3A","HAN","CH","N17",5,2]
["1/10/SOT","1/10/3A","1/10/212",890,"3A","SOT","DE",212,1,10]
["4/7/SOT","4/7/3A","4/7/212",890,"3A","SOT","DE",212,4,7]
["4/8/SOT","4/8/3A","4/8/212",890,"3A","SOT","DE",212,4,8]
["5/8/SOT","5/8/3A","5/8/212",890,"3A","SOT","DE",212,5,8]
["1/3/BUR","1/3/3A","1/3/17",892,"3A","BUR","EN",17,1,3]
["1/4/BUR","1/4/3A","1/4/17",892,"3A","BUR","EN",17,1,4]
["3/1/BUR","3/1/3A","3/1/213",892,"3A","BUR","EN",213,3,1]
["3/7/BLU","3/7/3A","3/7/204",891,"3A","BLU","FR",204,3,7]
["4/3/BLU","4/3/3A","4/3/204",891,"3A","BLU","FR",204,4,3]
["4/4/BLU","4/4/3A","4/4/204",891,"3A","BLU","FR",204,4,4]
["5/9/BLU","5/9/3A","5/9/204",891,"3A","BLU","FR",204,5,9]
["3/3/LUN","3/3/3A","3/3/103",909,"3A","LUN","GG",103,3,3]
["1/1/MOT","1/1/3A","1/1/217",908,"3A","MOT","GS",217,1,1]
["1/2/MOT","1/2/3A","1/2/217",908,"3A","MOT","GS",217,1,2]
["1/9/STF","1/9/3A","1/9/117",958,"3A","STF","KS",117,1,9]
["2/1/CON","2/1/3A","2/1/112",893,"3A","CON","MA",112,2,1]
["2/2/CON","2/2/3A","2/2/112",893,"3A","CON","MA",112,2,2]
["3/2/CON","3/2/3A","3/2/112",893,"3A","CON","MA",112,3,2]
["5/3/CON","5/3/3A","5/3/112",893,"3A","CON","MA",112,5,3]
[{"$f":"CONCATENATE($I1191,\"/\",$J1191,\"/\",$F1191)","v":"5/4/CON"},{"$f":"CONCATENATE($I1191,\"/\",$J1191,\"/\",$E1191)","v":"5/4/3A"},{"$f":"CONCATENATE($I1191,\"/\",$J1191,\"/\",$H1191)","v":"5/4/112"},893,"3A","CON","MA",112,5,4]
["3/9/GUT","3/9/3A","3/9/222",914,"3A","GUT","MU",222,3,9]
["3/10/GUT","3/10/3A","3/10/222",914,"3A","GUT","MU",222,3,10]
["3/8/STF","3/8/3A","3/8/117",915,"3A","STF","WR",117,3,8]
["5/7/STF","5/7/3A","5/7/117",915,"3A","STF","WR",117,5,7]
["3/9/SIE","3/9/3B","3/9/U47",984,"3B","SIE","BG","U47",3,9]
["3/10/SIE","3/10/3B","3/10/U47",984,"3B","SIE","BG","U47",3,10]
["5/7/MEZ","5/7/3B","5/7/N11",973,"3B","MEZ","BI","N11",5,7]
["5/8/MEZ","5/8/3B","5/8/N11",973,"3B","MEZ","BI","N11",5,8]
["2/1/MEZ","2/1/3B","2/1/N02",974,"3B","MEZ","BP","N02",2,1]
["2/2/MEZ","2/2/3B","2/2/N02",974,"3B","MEZ","BP","N02",2,2]
["5/3/BRG","5/3/3B","5/3/N12",976,"3B","BRG","CH","N12",5,3]
["5/4/BRG","5/4/3B","5/4/N12",976,"3B","BRG","CH","N12",5,4]
["1/3/LIE","1/3/3B","1/3/215",964,"3B","LIE","DE",215,1,3]
["1/4/LIE","1/4/3B","1/4/215",964,"3B","LIE","DE",215,1,4]
["3/1/LIE","3/1/3B","3/1/215",964,"3B","LIE","DE",215,3,1]
["3/2/LIE","3/2/3B","3/2/215",964,"3B","LIE","DE",215,3,2]
["3/3/SEI","3/3/3B","3/3/15",966,"3B","SEI","EN",15,3,3]
["4/8/SEI","4/8/3B","4/8/14",966,"3B","SEI","EN",14,4,8]
["4/9/SEI","4/9/3B","4/9/14",966,"3B","SEI","EN",14,4,9]
["2/9/BIL","2/9/3B","2/9/206",965,"3B","BIL","FR",206,2,9]
["2/10/BIL","2/10/3B","2/10/206",965,"3B","BIL","FR",206,2,10]
["4/1/BIL","4/1/3B","4/1/206",965,"3B","BIL","FR",206,4,1]
["4/2/BIL","4/2/3B","4/2/206",965,"3B","BIL","FR",206,4,2]
["3/8/WER","3/8/3B","3/8/116",983,"3B","WER","GG",116,3,8]
["2/7/HAU","2/7/3B","2/7/219",982,"3B","HAU","GS",219,2,7]
["2/8/HAU","2/8/3B","2/8/219",982,"3B","HAU","GS",219,2,8]
["4/7/BIL","4/7/3B","4/7/206",1032,"3B","BIL","KS",206,4,7]
["1/1/CON","1/1/3B","1/1/112",967,"3B","CON","MA",112,1,1]
["2/3/CON","2/3/3B","2/3/112",967,"3B","CON","MA",112,2,3]
["2/4/CON","2/4/3B","2/4/112",967,"3B","CON","MA",112,2,4]
["5/1/CON","5/1/3B","5/1/112",967,"3B","CON","MA",112,5,1]
["5/2/CON","5/2/3B","5/2/112",967,"3B","CON","MA",112,5,2]
["4/3/BEL","4/3/3B","4/3/222",988,"3B","BEL","MU",222,4,3]
["4/4/BEL","4/4/3B","4/4/222",988,"3B","BEL","MU",222,4,4]
["1/2/STF","1/2/3B","1/2/117",989,"3B","STF","WR",117,1,2]
["3/7/STF","3/7/3B","3/7/117",989,"3B","STF","WR",117,3,7]
["5/7/STC","5/7/3C","5/7/119",1058,"3C","STC","BG",119,5,7]
["5/8/STC","5/8/3C","5/8/119",1058,"3C","STC","BG",119,5,8]
["4/7/LUM","4/7/3C","4/7/N07",1047,"3C","LUM","BI","N07",4,7]
["4/8/LUM","4/8/3C","4/8/N07",1047,"3C","LUM","BI","N07",4,8]
["1/9/LUM","1/9/3C","1/9/N07",1048,"3C","LUM","BP","N07",1,9]
["1/10/LUM","1/10/3C","1/10/N07",1048,"3C","LUM","BP","N07",1,10]
["2/3/HAN","2/3/3C","2/3/N17",1050,"3C","HAN","CH","N17",2,3]
["2/4/HAN","2/4/3C","2/4/N17",1050,"3C","HAN","CH","N17",2,4]
["3/1/MOR","3/1/3C","3/1/207",1038,"3C","MOR","DE",207,3,1]
["3/2/MOR","3/2/3C","3/2/207",1038,"3C","MOR","DE",207,3,2]
["4/3/MOR","4/3/3C","4/3/207",1038,"3C","MOR","DE",207,4,3]
["4/4/MOR","4/4/3C","4/4/207",1038,"3C","MOR","DE",207,4,4]
["2/8/KUR","2/8/3C","2/8/13",1040,"3C","KUR","EN",13,2,8]
["5/3/KUR","5/3/3C","5/3/13",1040,"3C","KUR","EN",13,5,3]
["5/4/KUR","5/4/3C","5/4/13",1040,"3C","KUR","EN",13,5,4]
["1/1/KAU","1/1/3C","1/1/206",1039,"3C","KAU","FR",206,1,1]
["1/2/KAU","1/2/3C","1/2/206",1039,"3C","KAU","FR",206,1,2]
["3/7/KAU","3/7/3C","3/7/206",1039,"3C","KAU","FR",206,3,7]
["3/8/KAU","3/8/3C","3/8/206",1039,"3C","KAU","FR",206,3,8]
["3/4/LUN","3/4/3C","3/4/103",1057,"3C","LUN","GG",103,3,4]
["1/7/HAU","1/7/3C","1/7/219",1056,"3C","HAU","GS",219,1,7]
["1/8/HAU","1/8/3C","1/8/219",1056,"3C","HAU","GS",219,1,8]
["2/7/KUR","2/7/3C","2/7/13",1106,"3C","KUR","KS",13,2,7]
["3/9/GRU","3/9/3C","3/9/143",1041,"3C","GRU","MA",143,3,9]
["4/1/GRU","4/1/3C","4/1/146",1041,"3C","GRU","MA",146,4,1]
["4/2/GRU","4/2/3C","4/2/146",1041,"3C","GRU","MA",146,4,2]
["5/1/GRU","5/1/3C","5/1/143",1041,"3C","GRU","MA",143,5,1]
[{"$f":"CONCATENATE($I1255,\"/\",$J1255,\"/\",$F1255)","v":"5/2/GRU"},{"$f":"CONCATENATE($I1255,\"/\",$J1255,\"/\",$E1255)","v":"5/2/3C"},{"$f":"CONCATENATE($I1255,\"/\",$J1255,\"/\",$H1255)","v":"5/2/143"},1041,"3C","GRU","MA",143,5,2]
["2/9/SAN","2/9/3C","2/9/222",1062,"3C","SAN","MU",222,2,9]
["2/10/SAN","2/10/3C","2/10/222",1062,"3C","SAN","MU",222,2,10]
["1/3/STF","1/3/3C","1/3/117",1063,"3C","STF","WR",117,1,3]
["1/4/STF","1/4/3C","1/4/117",1063,"3C","STF","WR",117,1,4]
["3/4/STC","3/4/3D","3/4/U45",1132,"3D","STC","BG","U45",3,4]
["3/5/STC","3/5/3D","3/5/U45",1132,"3D","STC","BG","U45",3,5]
["2/7/LUM","2/7/3D","2/7/N17",1121,"3D","LUM","BI","N17",2,7]
["2/8/LUM","2/8/3D","2/8/N17",1121,"3D","LUM","BI","N17",2,8]
["4/1/LUM","4/1/3D","4/1/N07",1122,"3D","LUM","BP","N07",4,1]
["4/2/LUM","4/2/3D","4/2/N07",1122,"3D","LUM","BP","N07",4,2]
["1/3/HAN","1/3/3D","1/3/N17",1124,"3D","HAN","CH","N17",1,3]
["1/4/HAN","1/4/3D","1/4/N17",1124,"3D","HAN","CH","N17",1,4]
["2/3/BRN","2/3/3D","2/3/216",1112,"3D","BRN","DE",216,2,3]
["2/4/BRN","2/4/3D","2/4/216",1112,"3D","BRN","DE",216,2,4]
["5/1/BRN","5/1/3D","5/1/216",1112,"3D","BRN","DE",216,5,1]
["5/2/BRN","5/2/3D","5/2/216",1112,"3D","BRN","DE",216,5,2]
["2/9/KUR","2/9/3D","2/9/13",1114,"3D","KUR","EN",13,2,9]
["3/1/KUR","3/1/3D","3/1/13",1114,"3D","KUR","EN",13,3,1]
["3/2/KUR","3/2/3D","3/2/13",1114,"3D","KUR","EN",13,3,2]
["1/7/KAU","1/7/3D","1/7/206",1113,"3D","KAU","FR",206,1,7]
["1/8/KAU","1/8/3D","1/8/206",1113,"3D","KAU","FR",206,1,8]
["3/9/KAU","3/9/3D","3/9/206",1113,"3D","KAU","FR",206,3,9]
["3/10/KAU","3/10/3D","3/10/206",1113,"3D","KAU","FR",206,3,10]
["2/10/DIS","2/10/3D","2/10/106",1131,"3D","DIS","GG",106,2,10]
["5/7/HAU","5/7/3D","5/7/219",1130,"3D","HAU","GS",219,5,7]
["5/8/HAU","5/8/3D","5/8/219",1130,"3D","HAU","GS",219,5,8]
["5/4/BRN","5/4/3D","5/4/215",1180,"3D","BRN","KS",215,5,4]
["3/7/GRU","3/7/3D","3/7/143",1115,"3D","GRU","MA",143,3,7]
["3/8/GRU","3/8/3D","3/8/143",1115,"3D","GRU","MA",143,3,8]
["4/3/GRU","4/3/3D","4/3/146",1115,"3D","GRU","MA",146,4,3]
["4/4/GRU","4/4/3D","4/4/146",1115,"3D","GRU","MA",146,4,4]
["5/3/GRU","5/3/3D","5/3/143",1115,"3D","GRU","MA",143,5,3]
["1/1/SAN","1/1/3D","1/1/222",1136,"3D","SAN","MU",222,1,1]
["1/2/SAN","1/2/3D","1/2/222",1136,"3D","SAN","MU",222,1,2]
["4/7/SAR","4/7/3D","4/7/210",1137,"3D","SAR","WR",210,4,7]
["4/8/SAR","4/8/3D","4/8/210",1137,"3D","SAR","WR",210,4,8]
["2/1/SIE","2/1/3K","2/1/U47",1206,"3K","SIE","BG","U47",2,1]
["2/2/SIE","2/2/3K","2/2/U47",1206,"3K","SIE","BG","U47",2,2]
["4/7/KAP","4/7/3K","4/7/N01",1195,"3K","KAP","BI","N01",4,7]
["4/8/KAP","4/8/3K","4/8/N01",1195,"3K","KAP","BI","N01",4,8]
["4/9/KAP","4/9/3K","4/9/N01",1196,"3K","KAP","BP","N01",4,9]
["4/10/KAP","4/10/3K","4/10/N01",1196,"3K","KAP","BP","N01",4,10]
["5/3/HAN","5/3/3K","5/3/N17",1198,"3K","HAN","CH","N17",5,3]
["5/4/HAN","5/4/3K","5/4/N17",1198,"3K","HAN","CH","N17",5,4]
["1/2/SOT","1/2/3K","1/2/212",1186,"3K","SOT","DE",212,1,2]
["4/3/SOT","4/3/3K","4/3/212",1186,"3K","SOT","DE",212,4,3]
["4/4/SOT","4/4/3K","4/4/212",1186,"3K","SOT","DE",212,4,4]
["5/7/SOT","5/7/3K","5/7/212",1186,"3K","SOT","DE",212,5,7]
["1/1/PEY","1/1/3K","1/1/12",1188,"3K","PEY","EN",12,1,1]
["2/10/PEY","2/10/3K","2/10/12",1188,"3K","PEY","EN",12,2,10]
["5/2/PEY","5/2/3K","5/2/12",1188,"3K","PEY","EN",12,5,2]
["2/3/MOT","2/3/3K","2/3/217",1187,"3K","MOT","FR",217,2,3]
["2/4/MOT","2/4/3K","2/4/217",1187,"3K","MOT","FR",217,2,4]
["4/2/MOT","4/2/3K","4/2/217",1187,"3K","MOT","FR",217,4,2]
["5/8/MOT","5/8/3K","5/8/217",1187,"3K","MOT","FR",217,5,8]
["2/9/DIS","2/9/3K","2/9/106",1205,"3K","DIS","GG",106,2,9]
["1/3/FIR","1/3/3K","1/3/216",1204,"3K","FIR","GS",216,1,3]
["1/4/FIR","1/4/3K","1/4/216",1204,"3K","FIR","GS",216,1,4]
["4/1/MOT","4/1/3K","4/1/217",1254,"3K","MOT","KS",217,4,1]
["1/7/ZEM","1/7/3K","1/7/146",1189,"3K","ZEM","MA",146,1,7]
["1/8/ZEM","1/8/3K","1/8/146",1189,"3K","ZEM","MA",146,1,8]
["3/7/ZEM","3/7/3K","3/7/146",1189,"3K","ZEM","MA",146,3,7]
["3/8/ZEM","3/8/3K","3/8/146",1189,"3K","ZEM","MA",146,3,8]
[{"$f":"CONCATENATE($I1319,\"/\",$J1319,\"/\",$F1319)","v":"5/9/ZEM"},{"$f":"CONCATENATE($I1319,\"/\",$J1319,\"/\",$E1319)","v":"5/9/3K"},{"$f":"CONCATENATE($I1319,\"/\",$J1319,\"/\",$H1319)","v":"5/9/146"},1189,"3K","ZEM","MA",146,5,9]
["3/3/BEL","3/3/3K","3/3/119",1210,"3K","BEL","MU",119,3,3]
["3/4/BEL","3/4/3K","3/4/119",1210,"3K","BEL","MU",119,3,4]
["3/1/SAR","3/1/3K","3/1/210",1211,"3K","SAR","WR",210,3,1]
["3/2/SAR","3/2/3K","3/2/210",1211,"3K","SAR","WR",210,3,2]
["2/1/SMN","2/1/3L","2/1/119",1280,"3L","SMN","BG",119,2,1]
["2/2/SMN","2/2/3L","2/2/119",1280,"3L","SMN","BG",119,2,2]
["1/9/KAP","1/9/3L","1/9/N06",1269,"3L","KAP","BI","N06",1,9]
["1/10/KAP","1/10/3L","1/10/N06",1269,"3L","KAP","BI","N06",1,10]
["3/3/BRG","3/3/3L","3/3/N12",1272,"3L","BRG","CH","N12",3,3]
["3/4/BRG","3/4/3L","3/4/N12",1272,"3L","BRG","CH","N12",3,4]
["1/3/SOT","1/3/3L","1/3/212",1260,"3L","SOT","DE",212,1,3]
["1/4/SOT","1/4/3L","1/4/212",1260,"3L","SOT","DE",212,1,4]
["3/9/SOT","3/9/3L","3/9/212",1260,"3L","SOT","DE",212,3,9]
["5/9/SOT","5/9/3L","5/9/212",1260,"3L","SOT","DE",212,5,9]
["1/2/PEY","1/2/3L","1/2/12",1262,"3L","PEY","EN",12,1,2]
["5/7/PEY","5/7/3L","5/7/12",1262,"3L","PEY","EN",12,5,7]
["5/8/PEY","5/8/3L","5/8/12",1262,"3L","PEY","EN",12,5,8]
["4/7/MOT","4/7/3L","4/7/217",1261,"3L","MOT","FR",217,4,7]
["4/8/MOT","4/8/3L","4/8/217",1261,"3L","MOT","FR",217,4,8]
["5/4/MOT","5/4/3L","5/4/217",1261,"3L","MOT","FR",217,5,4]
["3/1/LUN","3/1/3L","3/1/103",1279,"3L","LUN","GG",103,3,1]
["3/2/LUN","3/2/3L","3/2/103",1279,"3L","LUN","GG",103,3,2]
["1/7/FIR","1/7/3L","1/7/217",1278,"3L","FIR","GS",217,1,7]
["1/8/FIR","1/8/3L","1/8/217",1278,"3L","FIR","GS",217,1,8]
["4/1/VIV","4/1/3L","4/1/N01",1328,"3L","VIV","KS","N01",4,1]
["4/2/KAP","4/2/3L","4/2/~N01~N02",1276,"3L","KAP","LN","~N01~N02",4,2]
["4/3/KAP","4/3/3L","4/3/~N01~N02",1276,"3L","KAP","LN","~N01~N02",4,3]
["4/4/KAP","4/4/3L","4/4/~N01~N02",1276,"3L","KAP","LN","~N01~N02",4,4]
["4/2/VIV","4/2/3L","4/2/~N01~N02",1276,"3L","VIV","LN","~N01~N02",4,2]
["4/3/VIV","4/3/3L","4/3/~N01~N02",1276,"3L","VIV","LN","~N01~N02",4,3]
["4/4/VIV","4/4/3L","4/4/~N01~N02",1276,"3L","VIV","LN","~N01~N02",4,4]
["2/3/VIV","2/3/3L","2/3/113",1263,"3L","VIV","MA",113,2,3]
["2/4/VIV","2/4/3L","2/4/113",1263,"3L","VIV","MA",113,2,4]
["4/9/VIV","4/9/3L","4/9/113",1263,"3L","VIV","MA",113,4,9]
["4/10/VIV","4/10/3L","4/10/113",1263,"3L","VIV","MA",113,4,10]
["3/7/GUT","3/7/3L","3/7/222",1284,"3L","GUT","MU",222,3,7]
["3/8/GUT","3/8/3L","3/8/222",1284,"3L","GUT","MU",222,3,8]
["5/2/STF","5/2/3L","5/2/117",1285,"3L","STF","WR",117,5,2]
["5/3/STF","5/3/3L","5/3/117",1285,"3L","STF","WR",117,5,3]
["4/3/SMN","4/3/4A","4/3/119",1354,"4A","SMN","BG",119,4,3]
["4/4/SMN","4/4/4A","4/4/119",1354,"4A","SMN","BG",119,4,4]
["4/3/SIE","4/3/4C","4/3/U47",1354,"4C","SIE","BG","U47",4,3]
["4/4/SIE","4/4/4C","4/4/U47",1354,"4C","SIE","BG","U47",4,4]
["4/3/SIE","4/3/4L","4/3/U47",1354,"4L","SIE","BG","U47",4,3]
["4/4/SIE","4/4/4L","4/4/U47",1354,"4L","SIE","BG","U47",4,4]
["4/3/HUJ","4/3/4L","4/3/122",1354,"4L","HUJ","BG",122,4,3]
["4/4/HUJ","4/4/4L","4/4/122",1354,"4L","HUJ","BG",122,4,4]
["4/3/HUJ","4/3/4K","4/3/122",1354,"4K","HUJ","BG",122,4,3]
["4/4/HUJ","4/4/4K","4/4/122",1354,"4K","HUJ","BG",122,4,4]
["4/3/THM","4/3/4A","4/3/22",1354,"4A","THM","MU",22,4,3]
["4/4/THM","4/4/4A","4/4/22",1354,"4A","THM","MU",22,4,4]
["4/3/THM","4/3/4C","4/3/22",1354,"4C","THM","MU",22,4,3]
["4/4/THM","4/4/4C","4/4/22",1354,"4C","THM","MU",22,4,4]
["4/3/THM","4/3/4L","4/3/22",1354,"4L","THM","MU",22,4,3]
["4/4/THM","4/4/4L","4/4/22",1354,"4L","THM","MU",22,4,4]
["4/3/THM","4/3/4K","4/3/22",1354,"4K","THM","MU",22,4,3]
["4/4/THM","4/4/4K","4/4/22",1354,"4K","THM","MU",22,4,4]
["4/9/STA","4/9/4A","4/9/N06",1343,"4A","STA","BI","N06",4,9]
["4/10/STA","4/10/4A","4/10/N06",1343,"4A","STA","BI","N06",4,10]
["1/3/MUN","1/3/4A","1/3/N16",1346,"4A","MUN","CH","N16",1,3]
["1/4/MUN","1/4/4A","1/4/N16",1346,"4A","MUN","CH","N16",1,4]
["1/7/ZUG","1/7/4A","1/7/213",1334,"4A","ZUG","DE",213,1,7]
["1/8/ZUG","1/8/4A","1/8/213",1334,"4A","ZUG","DE",213,1,8]
[{"$f":"CONCATENATE($I1383,\"/\",$J1383,\"/\",$F1383)","v":"3/3/ZUG"},{"$f":"CONCATENATE($I1383,\"/\",$J1383,\"/\",$E1383)","v":"3/3/4A"},{"$f":"CONCATENATE($I1383,\"/\",$J1383,\"/\",$H1383)","v":"3/3/219"},1334,"4A","ZUG","DE",219,3,3]
["3/4/ZUG","3/4/4A","3/4/219",1334,"4A","ZUG","DE",219,3,4]
["1/2/BUR","1/2/4A","1/2/17",1336,"4A","BUR","EN",17,1,2]
["3/2/BUR","3/2/4A","3/2/213",1336,"4A","BUR","EN",213,3,2]
["1/1/BLU","1/1/4A","1/1/204",1335,"4A","BLU","FR",204,1,1]
["5/7/BLU","5/7/4A","5/7/204",1335,"4A","BLU","FR",204,5,7]
["5/8/BLU","5/8/4A","5/8/204",1335,"4A","BLU","FR",204,5,8]
["2/7/LUN","2/7/4A","2/7/103",1353,"4A","LUN","GG",103,2,7]
["2/8/LUN","2/8/4A","2/8/103",1353,"4A","LUN","GG",103,2,8]
["5/3/HAU","5/3/4A","5/3/219",1352,"4A","HAU","GS",219,5,3]
["5/4/HAU","5/4/4A","5/4/219",1352,"4A","HAU","GS",219,5,4]
["2/4/MUN","2/4/4A","2/4/N16",1402,"4A","MUN","KS","N16",2,4]
["2/9/DIN","2/9/4A","2/9/112",1337,"4A","DIN","MA",112,2,9]
["2/10/DIN","2/10/4A","2/10/112",1337,"4A","DIN","MA",112,2,10]
["4/1/DIN","4/1/4A","4/1/113",1337,"4A","DIN","MA",113,4,1]
["4/2/DIN","4/2/4A","4/2/113",1337,"4A","DIN","MA",113,4,2]
["2/1/STM","2/1/4A","2/1/110",1345,"4A","STM","PS",110,2,1]
["2/2/STM","2/2/4A","2/2/110",1345,"4A","STM","PS",110,2,2]
["4/7/BRE","4/7/4A","4/7/244",1363,"4A","BRE","RE",244,4,7]
["4/8/BRE","4/8/4A","4/8/244",1363,"4A","BRE","RE",244,4,8]
["2/3/KUT","2/3/4A","2/3/208",1359,"4A","KUT","WR",208,2,3]
["4/7/STA","4/7/4B","4/7/N06",1417,"4B","STA","BI","N06",4,7]
["4/8/STA","4/8/4B","4/8/N06",1417,"4B","STA","BI","N06",4,8]
["1/7/MUN","1/7/4B","1/7/N16",1420,"4B","MUN","CH","N16",1,7]
["1/8/MUN","1/8/4B","1/8/N16",1420,"4B","MUN","CH","N16",1,8]
["4/1/ZUG","4/1/4B","4/1/216",1408,"4B","ZUG","DE",216,4,1]
["4/2/ZUG","4/2/4B","4/2/216",1408,"4B","ZUG","DE",216,4,2]
["5/7/ZUG","5/7/4B","5/7/216",1408,"4B","ZUG","DE",216,5,7]
["5/8/ZUG","5/8/4B","5/8/216",1408,"4B","ZUG","DE",216,5,8]
["1/1/BUA","1/1/4B","1/1/16",1410,"4B","BUA","EN",16,1,1]
["3/2/BUA","3/2/4B","3/2/16",1410,"4B","BUA","EN",16,3,2]
["3/3/BLU","3/3/4B","3/3/204",1409,"4B","BLU","FR",204,3,3]
["5/3/BLU","5/3/4B","5/3/204",1409,"4B","BLU","FR",204,5,3]
["5/4/BLU","5/4/4B","5/4/204",1409,"4B","BLU","FR",204,5,4]
["2/1/LUN","2/1/4B","2/1/103",1427,"4B","LUN","GG",103,2,1]
["2/2/LUN","2/2/4B","2/2/103",1427,"4B","LUN","GG",103,2,2]
["5/9/MOT","5/9/4B","5/9/217",1426,"4B","MOT","GS",217,5,9]
["5/10/MOT","5/10/4B","5/10/217",1426,"4B","MOT","GS",217,5,10]
["3/4/STA","3/4/4B","3/4/N06",1476,"4B","STA","KS","N06",3,4]
["2/7/DIN","2/7/4B","2/7/112",1411,"4B","DIN","MA",112,2,7]
["2/8/DIN","2/8/4B","2/8/112",1411,"4B","DIN","MA",112,2,8]
["4/9/DIN","4/9/4B","4/9/112",1411,"4B","DIN","MA",112,4,9]
["4/10/DIN","4/10/4B","4/10/112",1411,"4B","DIN","MA",112,4,10]
["1/3/STM","1/3/4B","1/3/110",1419,"4B","STM","PS",110,1,3]
["1/4/STM","1/4/4B","1/4/110",1419,"4B","STM","PS",110,1,4]
["4/3/BRE","4/3/4B","4/3/244",1437,"4B","BRE","RE",244,4,3]
["4/4/BRE","4/4/4B","4/4/244",1437,"4B","BRE","RE",244,4,4]
["1/2/KUT","1/2/4B","1/2/208",1433,"4B","KUT","WR",208,1,2]
["1/7/LUM","1/7/4C","1/7/N07",1491,"4C","LUM","BI","N07",1,7]
["1/8/LUM","1/8/4C","1/8/N07",1491,"4C","LUM","BI","N07",1,8]
["2/1/MUN","2/1/4C","2/1/N16",1494,"4C","MUN","CH","N16",2,1]
["2/2/MUN","2/2/4C","2/2/N16",1494,"4C","MUN","CH","N16",2,2]
["2/3/ARN","2/3/4C","2/3/213",1482,"4C","ARN","DE",213,2,3]
["2/4/ARN","2/4/4C","2/4/213",1482,"4C","ARN","DE",213,2,4]
["5/7/ARN","5/7/4C","5/7/213",1482,"4C","ARN","DE",213,5,7]
["5/8/ARN","5/8/4C","5/8/213",1482,"4C","ARN","DE",213,5,8]
["3/2/SEI","3/2/4C","3/2/15",1484,"4C","SEI","EN",15,3,2]
["4/2/SEI","4/2/4C","4/2/117",1484,"4C","SEI","EN",117,4,2]
["3/1/BIL","3/1/4C","3/1/206",1483,"4C","BIL","FR",206,3,1]
["5/3/BIL","5/3/4C","5/3/206",1483,"4C","BIL","FR",206,5,3]
["5/4/BIL","5/4/4C","5/4/206",1483,"4C","BIL","FR",206,5,4]
["4/7/DIS","4/7/4C","4/7/106",1501,"4C","DIS","GG",106,4,7]
["4/8/DIS","4/8/4C","4/8/106",1501,"4C","DIS","GG",106,4,8]
["3/3/FIS","3/3/4C","3/3/203",1500,"4C","FIS","GS",203,3,3]
[{"$f":"CONCATENATE($I1447,\"/\",$J1447,\"/\",$F1447)","v":"3/4/FIS"},{"$f":"CONCATENATE($I1447,\"/\",$J1447,\"/\",$E1447)","v":"3/4/4C"},{"$f":"CONCATENATE($I1447,\"/\",$J1447,\"/\",$H1447)","v":"3/4/203"},1500,"4C","FIS","GS",203,3,4]
["4/6/LUM","4/6/4C","4/6/N07",1550,"4C","LUM","KS","N07",4,6]
["1/3/ZEM","1/3/4C","1/3/146",1485,"4C","ZEM","MA",146,1,3]
["1/4/ZEM","1/4/4C","1/4/146",1485,"4C","ZEM","MA",146,1,4]
["3/9/ZEM","3/9/4C","3/9/146",1485,"4C","ZEM","MA",146,3,9]
["3/10/ZEM","3/10/4C","3/10/146",1485,"4C","ZEM","MA",146,3,10]
["1/1/CHI","1/1/4C","1/1/107",1493,"4C","CHI","PS",107,1,1]
["1/2/CHI","1/2/4C","1/2/107",1493,"4C","CHI","PS",107,1,2]
["2/7/BRE","2/7/4C","2/7/244",1511,"4C","BRE","RE",244,2,7]
["2/8/BRE","2/8/4C","2/8/244",1511,"4C","BRE","RE",244,2,8]
["4/1/SAR","4/1/4C","4/1/210",1507,"4C","SAR","WR",210,4,1]
["2/9/WER","2/9/4D","2/9/N01",1565,"4D","WER","BI","N01",2,9]
["2/10/WER","2/10/4D","2/10/N01",1565,"4D","WER","BI","N01",2,10]
["4/9/HAN","4/9/4D","4/9/N17",1568,"4D","HAN","CH","N17",4,9]
["4/10/HAN","4/10/4D","4/10/N17",1568,"4D","HAN","CH","N17",4,10]
["2/7/ARN","2/7/4D","2/7/213",1556,"4D","ARN","DE",213,2,7]
["2/8/ARN","2/8/4D","2/8/213",1556,"4D","ARN","DE",213,2,8]
["4/3/ARN","4/3/4D","4/3/213",1556,"4D","ARN","DE",213,4,3]
["4/4/ARN","4/4/4D","4/4/213",1556,"4D","ARN","DE",213,4,4]
["3/1/SEI","3/1/4D","3/1/15",1558,"4D","SEI","EN",15,3,1]
["5/9/SEI","5/9/4D","5/9/14",1558,"4D","SEI","EN",14,5,9]
["1/1/SPE","1/1/4D","1/1/E51",1557,"4D","SPE","FR","E51",1,1]
["1/2/SPE","1/2/4D","1/2/E51",1557,"4D","SPE","FR","E51",1,2]
["3/9/SPE","3/9/4D","3/9/E51",1557,"4D","SPE","FR","E51",3,9]
["5/7/WER","5/7/4D","5/7/116",1575,"4D","WER","GG",116,5,7]
["5/8/WER","5/8/4D","5/8/116",1575,"4D","WER","GG",116,5,8]
["1/3/HAU","1/3/4D","1/3/219",1574,"4D","HAU","GS",219,1,3]
["1/4/HAU","1/4/4D","1/4/219",1574,"4D","HAU","GS",219,1,4]
["4/1/SEI","4/1/4D","4/1/117",1624,"4D","SEI","KS",117,4,1]
["2/1/GEU","2/1/4D","2/1/146",1559,"4D","GEU","MA",146,2,1]
["2/2/GEU","2/2/4D","2/2/146",1559,"4D","GEU","MA",146,2,2]
["5/3/GEU","5/3/4D","5/3/146",1559,"4D","GEU","MA",146,5,3]
["5/4/GEU","5/4/4D","5/4/146",1559,"4D","GEU","MA",146,5,4]
["4/7/SRO","4/7/4D","4/7/107",1567,"4D","SRO","PS",107,4,7]
["4/8/SRO","4/8/4D","4/8/107",1567,"4D","SRO","PS",107,4,8]
["3/3/RER","3/3/4D","3/3/245",1585,"4D","RER","RE",245,3,3]
["3/4/RER","3/4/4D","3/4/245",1585,"4D","RER","RE",245,3,4]
["4/2/SAR","4/2/4D","4/2/210",1581,"4D","SAR","WR",210,4,2]
["3/9/MEZ","3/9/4G","3/9/N01",1639,"4G","MEZ","BI","N01",3,9]
["3/10/MEZ","3/10/4G","3/10/N01",1639,"4G","MEZ","BI","N01",3,10]
["4/7/BRG","4/7/4G","4/7/N12",1642,"4G","BRG","CH","N12",4,7]
["4/8/BRG","4/8/4G","4/8/N12",1642,"4G","BRG","CH","N12",4,8]
["1/3/MOR","1/3/4G","1/3/207",1630,"4G","MOR","DE",207,1,3]
["1/4/MOR","1/4/4G","1/4/207",1630,"4G","MOR","DE",207,1,4]
["4/1/MOR","4/1/4G","4/1/207",1630,"4G","MOR","DE",207,4,1]
["4/2/MOR","4/2/4G","4/2/207",1630,"4G","MOR","DE",207,4,2]
["1/9/PEY","1/9/4G","1/9/12",1632,"4G","PEY","EN",12,1,9]
["4/4/PEY","4/4/4G","4/4/12",1632,"4G","PEY","EN",12,4,4]
["1/10/SPE","1/10/4G","1/10/E51",1631,"4G","SPE","FR","E51",1,10]
["5/3/SPE","5/3/4G","5/3/E51",1631,"4G","SPE","FR","E51",5,3]
["5/4/SPE","5/4/4G","5/4/E51",1631,"4G","SPE","FR","E51",5,4]
["5/9/WER","5/9/4G","5/9/116",1649,"4G","WER","GG",116,5,9]
["5/10/WER","5/10/4G","5/10/116",1649,"4G","WER","GG",116,5,10]
["2/1/HAU","2/1/4G","2/1/219",1648,"4G","HAU","GS",219,2,1]
["2/2/HAU","2/2/4G","2/2/219",1648,"4G","HAU","GS",219,2,2]
["2/9/MEZ","2/9/4G","2/9/N17",1698,"4G","MEZ","KS","N17",2,9]
["1/1/ZEM","1/1/4G","1/1/146",1633,"4G","ZEM","MA",146,1,1]
["1/2/ZEM","1/2/4G","1/2/146",1633,"4G","ZEM","MA",146,1,2]
["5/7/ZEM","5/7/4G","5/7/146",1633,"4G","ZEM","MA",146,5,7]
["5/8/ZEM","5/8/4G","5/8/146",1633,"4G","ZEM","MA",146,5,8]
["2/7/SRO","2/7/4G","2/7/107",1641,"4G","SRO","PS",107,2,7]
["2/8/SRO","2/8/4G","2/8/107",1641,"4G","SRO","PS",107,2,8]
["3/3/SWE","3/3/4G","3/3/243",1659,"4G","SWE","RE",243,3,3]
["3/4/SWE","3/4/4G","3/4/243",1659,"4G","SWE","RE",243,3,4]
[{"$f":"CONCATENATE($I1511,\"/\",$J1511,\"/\",$F1511)","v":"4/3/SAR"},{"$f":"CONCATENATE($I1511,\"/\",$J1511,\"/\",$E1511)","v":"4/3/4G"},{"$f":"CONCATENATE($I1511,\"/\",$J1511,\"/\",$H1511)","v":"4/3/210"},1655,"4G","SAR","WR",210,4,3]
["1/9/WER","1/9/4K","1/9/N12",1713,"4K","WER","BI","N12",1,9]
["1/10/WER","1/10/4K","1/10/N12",1713,"4K","WER","BI","N12",1,10]
["4/7/HAN","4/7/4K","4/7/N17",1716,"4K","HAN","CH","N17",4,7]
["4/8/HAN","4/8/4K","4/8/N17",1716,"4K","HAN","CH","N17",4,8]
["1/7/SOT","1/7/4K","1/7/212",1704,"4K","SOT","DE",212,1,7]
["1/8/SOT","1/8/4K","1/8/212",1704,"4K","SOT","DE",212,1,8]
["3/4/SOT","3/4/4K","3/4/212",1704,"4K","SOT","DE",212,3,4]
["5/3/SOT","5/3/4K","5/3/212",1704,"4K","SOT","DE",212,5,3]
["1/2/BUA","1/2/4K","1/2/16",1706,"4K","BUA","EN",16,1,2]
["3/3/BUA","3/3/4K","3/3/16",1706,"4K","BUA","EN",16,3,3]
["2/3/FIS","2/3/4K","2/3/203",1705,"4K","FIS","FR",203,2,3]
["2/4/FIS","2/4/4K","2/4/203",1705,"4K","FIS","FR",203,2,4]
["5/4/FIS","5/4/4K","5/4/203",1705,"4K","FIS","FR",203,5,4]
["2/1/DIS","2/1/4K","2/1/106",1723,"4K","DIS","GG",106,2,1]
["2/2/DIS","2/2/4K","2/2/106",1723,"4K","DIS","GG",106,2,2]
["1/3/FIS","1/3/4K","1/3/203",1722,"4K","FIS","GS",203,1,3]
["1/4/FIS","1/4/4K","1/4/203",1722,"4K","FIS","GS",203,1,4]
["3/10/BUA","3/10/4K","3/10/16",1772,"4K","BUA","KS",16,3,10]
["3/1/WID","3/1/4K","3/1/144",1707,"4K","WID","MA",144,3,1]
["3/2/WID","3/2/4K","3/2/144",1707,"4K","WID","MA",144,3,2]
["5/7/WID","5/7/4K","5/7/144",1707,"4K","WID","MA",144,5,7]
["5/8/WID","5/8/4K","5/8/144",1707,"4K","WID","MA",144,5,8]
["4/1/SRO","4/1/4K","4/1/107",1715,"4K","SRO","PS",107,4,1]
["4/2/SRO","4/2/4K","4/2/107",1715,"4K","SRO","PS",107,4,2]
["2/7/SWE","2/7/4K","2/7/243",1733,"4K","SWE","RE",243,2,7]
["2/8/SWE","2/8/4K","2/8/243",1733,"4K","SWE","RE",243,2,8]
["3/9/SAR","3/9/4K","3/9/210",1729,"4K","SAR","WR",210,3,9]
["1/7/KAP","1/7/4L","1/7/N06",1787,"4L","KAP","BI","N06",1,7]
["1/8/KAP","1/8/4L","1/8/N06",1787,"4L","KAP","BI","N06",1,8]
["2/7/BRG","2/7/4L","2/7/N12",1790,"4L","BRG","CH","N12",2,7]
["2/8/BRG","2/8/4L","2/8/N12",1790,"4L","BRG","CH","N12",2,8]
["1/3/CLE","1/3/4L","1/3/214",1778,"4L","CLE","DE",214,1,3]
["1/4/CLE","1/4/4L","1/4/214",1778,"4L","CLE","DE",214,1,4]
["5/3/CLE","5/3/4L","5/3/214",1778,"4L","CLE","DE",214,5,3]
["3/1/PEY","3/1/4L","3/1/12",1780,"4L","PEY","EN",12,3,1]
["4/2/PEY","4/2/4L","4/2/12",1780,"4L","PEY","EN",12,4,2]
["3/2/BIL","3/2/4L","3/2/206",1779,"4L","BIL","FR",206,3,2]
["5/7/BIL","5/7/4L","5/7/206",1779,"4L","BIL","FR",206,5,7]
["5/8/BIL","5/8/4L","5/8/206",1779,"4L","BIL","FR",206,5,8]
["2/3/LUN","2/3/4L","2/3/103",1797,"4L","LUN","GG",103,2,3]
["2/4/LUN","2/4/4L","2/4/103",1797,"4L","LUN","GG",103,2,4]
["3/3/BUD","3/3/4L","3/3/18",1796,"4L","BUD","GS",18,3,3]
["3/4/BUD","3/4/4L","3/4/18",1796,"4L","BUD","GS",18,3,4]
["5/4/KAP","5/4/4L","5/4/N06",1846,"4L","KAP","KS","N06",5,4]
["1/1/STM","1/1/4L","1/1/110",1794,"4L","STM","LN",110,1,1]
["1/2/STM","1/2/4L","1/2/110",1794,"4L","STM","LN",110,1,2]
["1/1/BAE","1/1/4L","1/1/THO",1794,"4L","BAE","LN","THO",1,1]
["1/2/BAE","1/2/4L","1/2/THO",1794,"4L","BAE","LN","THO",1,2]
["3/9/RER","3/9/4L","3/9/117",1795,"4L","RER","LZ",117,3,9]
["3/10/RER","3/10/4L","3/10/117",1795,"4L","RER","LZ",117,3,10]
["3/9/STF","3/9/4L","3/9/117",1795,"4L","STF","LZ",117,3,9]
["3/10/STF","3/10/4L","3/10/117",1795,"4L","STF","LZ",117,3,10]
["2/1/VIV","2/1/4L","2/1/113",1781,"4L","VIV","MA",113,2,1]
["2/2/VIV","2/2/4L","2/2/113",1781,"4L","VIV","MA",113,2,2]
["4/7/VIV","4/7/4L","4/7/113",1781,"4L","VIV","MA",113,4,7]
["4/8/VIV","4/8/4L","4/8/113",1781,"4L","VIV","MA",113,4,8]
["1/9/STM","1/9/4L","1/9/110",1789,"4L","STM","PS",110,1,9]
["1/10/STM","1/10/4L","1/10/110",1789,"4L","STM","PS",110,1,10]
["3/9/MUN","3/9/5A","3/9/N16",1864,"5A","MUN","CH","N16",3,9]
["4/9/MUN","4/9/5A","4/9/~N15~N16",1865,"5A","MUN","CP","~N15~N16",4,9]
["4/10/MUN","4/10/5A","4/10/~N15~N16",1865,"5A","MUN","CP","~N15~N16",4,10]
["1/1/MOR","1/1/5A","1/1/207",1852,"5A","MOR","DE",207,1,1]
["1/2/MOR","1/2/5A","1/2/207",1852,"5A","MOR","DE",207,1,2]
[{"$f":"CONCATENATE($I1575,\"/\",$J1575,\"/\",$F1575)","v":"3/3/MOR"},{"$f":"CONCATENATE($I1575,\"/\",$J1575,\"/\",$E1575)","v":"3/3/5A"},{"$f":"CONCATENATE($I1575,\"/\",$J1575,\"/\",$H1575)","v":"3/3/207"},1852,"5A","MOR","DE",207,3,3]
["3/4/MOR","3/4/5A","3/4/207",1852,"5A","MOR","DE",207,3,4]
["1/9/BUR","1/9/5A","1/9/17",1854,"5A","BUR","EN",17,1,9]
["5/3/BUR","5/3/5A","5/3/18",1854,"5A","BUR","EN",18,5,3]
["5/4/BUR","5/4/5A","5/4/18",1854,"5A","BUR","EN",18,5,4]
["1/3/SPE","1/3/5A","1/3/E51",1853,"5A","SPE","FR","E51",1,3]
["1/4/SPE","1/4/5A","1/4/E51",1853,"5A","SPE","FR","E51",1,4]
["3/8/SPE","3/8/5A","3/8/E51",1853,"5A","SPE","FR","E51",3,8]
["5/1/DIS","5/1/5A","5/1/106",1871,"5A","DIS","GG",106,5,1]
["5/2/DIS","5/2/5A","5/2/106",1871,"5A","DIS","GG",106,5,2]
["2/1/BIL","2/1/5A","2/1/206",1870,"5A","BIL","GS",206,2,1]
["2/2/BIL","2/2/5A","2/2/206",1870,"5A","BIL","GS",206,2,2]
["3/7/SPE","3/7/5A","3/7/E51",1920,"5A","SPE","KS","E51",3,7]
["4/1/RIS","4/1/5A","4/1/143",1855,"5A","RIS","MA",143,4,1]
["4/2/RIS","4/2/5A","4/2/143",1855,"5A","RIS","MA",143,4,2]
["5/9/RIS","5/9/5A","5/9/143",1855,"5A","RIS","MA",143,5,9]
["5/10/RIS","5/10/5A","5/10/143",1855,"5A","RIS","MA",143,5,10]
["2/9/SWE","2/9/5A","2/9/243",1878,"5A","SWE","PH",243,2,9]
["5/8/SWE","5/8/5A","5/8/243",1878,"5A","SWE","PH",243,5,8]
["4/7/DIN","4/7/5A","4/7/110",1863,"5A","DIN","PS",110,4,7]
["4/8/DIN","4/8/5A","4/8/110",1863,"5A","DIN","PS",110,4,8]
["1/9/HAN","1/9/5B","1/9/N17",1938,"5B","HAN","CH","N17",1,9]
["1/1/HAN","1/1/5B","1/1/N15",1939,"5B","HAN","CP","N15",1,1]
["1/2/HAN","1/2/5B","1/2/N15",1939,"5B","HAN","CP","N15",1,2]
["2/9/MOR","2/9/5B","2/9/207",1926,"5B","MOR","DE",207,2,9]
["2/10/MOR","2/10/5B","2/10/207",1926,"5B","MOR","DE",207,2,10]
["4/7/MOR","4/7/5B","4/7/207",1926,"5B","MOR","DE",207,4,7]
["4/8/MOR","4/8/5B","4/8/207",1926,"5B","MOR","DE",207,4,8]
["3/9/SEI","3/9/5B","3/9/15",1928,"5B","SEI","EN",15,3,9]
["5/7/SEI","5/7/5B","5/7/14",1928,"5B","SEI","EN",14,5,7]
["5/8/SEI","5/8/5B","5/8/14",1928,"5B","SEI","EN",14,5,8]
["2/3/BLU","2/3/5B","2/3/204",1927,"5B","BLU","FR",204,2,3]
["2/4/BLU","2/4/5B","2/4/204",1927,"5B","BLU","FR",204,2,4]
["5/1/BLU","5/1/5B","5/1/204",1927,"5B","BLU","FR",204,5,1]
["5/3/DIS","5/3/5B","5/3/106",1945,"5B","DIS","GG",106,5,3]
["5/4/DIS","5/4/5B","5/4/106",1945,"5B","DIS","GG",106,5,4]
["4/9/BIL","4/9/5B","4/9/206",1944,"5B","BIL","GS",206,4,9]
["4/10/BIL","4/10/5B","4/10/206",1944,"5B","BIL","GS",206,4,10]
["5/9/SWE","5/9/5B","5/9/243",1994,"5B","SWE","KS",243,5,9]
["3/7/GUH","3/7/5B","3/7/118",1929,"5B","GUH","MA",118,3,7]
["3/8/GUH","3/8/5B","3/8/118",1929,"5B","GUH","MA",118,3,8]
["4/1/GUH","4/1/5B","4/1/118",1929,"5B","GUH","MA",118,4,1]
["4/2/GUH","4/2/5B","4/2/118",1929,"5B","GUH","MA",118,4,2]
["1/3/SWE","1/3/5B","1/3/243",1952,"5B","SWE","PH",243,1,3]
["1/4/SWE","1/4/5B","1/4/243",1952,"5B","SWE","PH",243,1,4]
["3/3/SRO","3/3/5B","3/3/107",1937,"5B","SRO","PS",107,3,3]
["3/4/SRO","3/4/5B","3/4/107",1937,"5B","SRO","PS",107,3,4]
["4/8/STC","4/8/5D","4/8/122",53466,"5D","STC","BG",122,4,8]
["4/8/HUJ","4/8/5L","4/8/119",53466,"5L","HUJ","BG",119,4,8]
["4/8/SIE","4/8/5K","4/8/U47",53466,"5K","SIE","BG","U47",4,8]
["4/8/SAN","4/8/5D","4/8/22",53466,"5D","SAN","MU",22,4,8]
["4/8/SAN","4/8/5L","4/8/22",53466,"5L","SAN","MU",22,4,8]
["4/8/SAN","4/8/5K","4/8/22",53466,"5K","SAN","MU",22,4,8]
["4/7/STC","4/7/5D","4/7/122",2020,"5D","STC","BG",122,4,7]
["4/7/HUJ","4/7/5L","4/7/119",2020,"5L","HUJ","BG",119,4,7]
["4/7/SIE","4/7/5K","4/7/U47",2020,"5K","SIE","BG","U47",4,7]
["5/8/BRG","5/8/5D","5/8/N12",2012,"5D","BRG","CH","N12",5,8]
["2/1/BRG","2/1/5D","2/1/N15",2013,"5D","BRG","CP","N15",2,1]
["2/2/BRG","2/2/5D","2/2/N15",2013,"5D","BRG","CP","N15",2,2]
["1/9/CLE","1/9/5D","1/9/214",2000,"5D","CLE","DE",214,1,9]
["2/9/CLE","2/9/5D","2/9/214",2000,"5D","CLE","DE",214,2,9]
["2/10/CLE","2/10/5D","2/10/214",2000,"5D","CLE","DE",214,2,10]
["5/4/CLE","5/4/5D","5/4/214",2000,"5D","CLE","DE",214,5,4]
["1/10/BUR","1/10/5D","1/10/17",2002,"5D","BUR","EN",17,1,10]
[{"$f":"CONCATENATE($I1639,\"/\",$J1639,\"/\",$F1639)","v":"3/3/BUR"},{"$f":"CONCATENATE($I1639,\"/\",$J1639,\"/\",$E1639)","v":"3/3/5D"},{"$f":"CONCATENATE($I1639,\"/\",$J1639,\"/\",$H1639)","v":"3/3/213"},2002,"5D","BUR","EN",213,3,3]
["3/4/BUR","3/4/5D","3/4/213",2002,"5D","BUR","EN",213,3,4]
["3/7/FIS","3/7/5D","3/7/203",2001,"5D","FIS","FR",203,3,7]
["3/8/FIS","3/8/5D","3/8/203",2001,"5D","FIS","FR",203,3,8]
["5/3/FIS","5/3/5D","5/3/203",2001,"5D","FIS","FR",203,5,3]
["5/1/LUN","5/1/5D","5/1/103",2019,"5D","LUN","GG",103,5,1]
["5/2/LUN","5/2/5D","5/2/103",2019,"5D","LUN","GG",103,5,2]
["4/9/LIE","4/9/5D","4/9/215",2018,"5D","LIE","GS",215,4,9]
["4/10/LIE","4/10/5D","4/10/215",2018,"5D","LIE","GS",215,4,10]
["4/5/KUT","4/5/5D","4/5/117",2068,"5D","KUT","KS",117,4,5]
["2/7/GHE","2/7/5D","2/7/114",2003,"5D","GHE","MA",114,2,7]
["2/8/GHE","2/8/5D","2/8/114",2003,"5D","GHE","MA",114,2,8]
["4/1/GHE","4/1/5D","4/1/114",2003,"5D","GHE","MA",114,4,1]
["4/2/GHE","4/2/5D","4/2/114",2003,"5D","GHE","MA",114,4,2]
["1/1/SWE","1/1/5D","1/1/243",2026,"5D","SWE","PH",243,1,1]
["1/2/SWE","1/2/5D","1/2/243",2026,"5D","SWE","PH",243,1,2]
["1/3/CHI","1/3/5D","1/3/107",2011,"5D","CHI","PS",107,1,3]
["1/4/CHI","1/4/5D","1/4/107",2011,"5D","CHI","PS",107,1,4]
["5/7/BRG","5/7/5E","5/7/N12",2086,"5E","BRG","CH","N12",5,7]
["3/9/BRG","3/9/5E","3/9/N15",2087,"5E","BRG","CP","N15",3,9]
["3/10/BRG","3/10/5E","3/10/N15",2087,"5E","BRG","CP","N15",3,10]
["3/7/ARN","3/7/5E","3/7/213",2074,"5E","ARN","DE",213,3,7]
["3/8/ARN","3/8/5E","3/8/213",2074,"5E","ARN","DE",213,3,8]
["5/3/ARN","5/3/5E","5/3/213",2074,"5E","ARN","DE",213,5,3]
["5/4/ARN","5/4/5E","5/4/213",2074,"5E","ARN","DE",213,5,4]
["1/1/KUR","1/1/5E","1/1/13",2076,"5E","KUR","EN",13,1,1]
["1/2/KUR","1/2/5E","1/2/13",2076,"5E","KUR","EN",13,1,2]
["4/2/KUR","4/2/5E","4/2/13",2076,"5E","KUR","EN",13,4,2]
["3/3/GRB","3/3/5E","3/3/14",2075,"5E","GRB","FR",14,3,3]
["3/4/GRB","3/4/5E","3/4/14",2075,"5E","GRB","FR",14,3,4]
["5/2/GRB","5/2/5E","5/2/14",2075,"5E","GRB","FR",14,5,2]
["1/3/WER","1/3/5E","1/3/116",2093,"5E","WER","GG",116,1,3]
["1/4/WER","1/4/5E","1/4/116",2093,"5E","WER","GG",116,1,4]
["1/9/FIR","1/9/5E","1/9/217",2092,"5E","FIR","GS",217,1,9]
["1/10/FIR","1/10/5E","1/10/217",2092,"5E","FIR","GS",217,1,10]
["5/1/ARN","5/1/5E","5/1/213",2142,"5E","ARN","KS",213,5,1]
["2/3/RIS","2/3/5E","2/3/143",2077,"5E","RIS","MA",143,2,3]
["2/4/RIS","2/4/5E","2/4/143",2077,"5E","RIS","MA",143,2,4]
["4/7/RIS","4/7/5E","4/7/143",2077,"5E","RIS","MA",143,4,7]
["4/8/RIS","4/8/5E","4/8/143",2077,"5E","RIS","MA",143,4,8]
["4/9/SWE","4/9/5E","4/9/243",2100,"5E","SWE","PH",243,4,9]
["4/10/SWE","4/10/5E","4/10/243",2100,"5E","SWE","PH",243,4,10]
["2/9/CHI","2/9/5E","2/9/110",2085,"5E","CHI","PS",110,2,9]
["2/10/CHI","2/10/5E","2/10/110",2085,"5E","CHI","PS",110,2,10]
["5/9/BRG","5/9/5K","5/9/N12",2160,"5K","BRG","CH","N12",5,9]
["2/9/BRG","2/9/5K","2/9/N15",2161,"5K","BRG","CP","N15",2,9]
["2/10/BRG","2/10/5K","2/10/N15",2161,"5K","BRG","CP","N15",2,10]
["1/9/SOT","1/9/5K","1/9/212",2148,"5K","SOT","DE",212,1,9]
["4/9/SOT","4/9/5K","4/9/212",2148,"5K","SOT","DE",212,4,9]
["4/10/SOT","4/10/5K","4/10/212",2148,"5K","SOT","DE",212,4,10]
["5/4/SOT","5/4/5K","5/4/212",2148,"5K","SOT","DE",212,5,4]
["3/3/KUR","3/3/5K","3/3/13",2150,"5K","KUR","EN",13,3,3]
["3/4/KUR","3/4/5K","3/4/13",2150,"5K","KUR","EN",13,3,4]
["5/7/KUR","5/7/5K","5/7/13",2150,"5K","KUR","EN",13,5,7]
["1/1/GRB","1/1/5K","1/1/14",2149,"5K","GRB","FR",14,1,1]
["1/2/GRB","1/2/5K","1/2/14",2149,"5K","GRB","FR",14,1,2]
["3/8/GRB","3/8/5K","3/8/14",2149,"5K","GRB","FR",14,3,8]
["5/1/WER","5/1/5K","5/1/116",2167,"5K","WER","GG",116,5,1]
["5/2/WER","5/2/5K","5/2/116",2167,"5K","WER","GG",116,5,2]
["2/3/LIE","2/3/5K","2/3/215",2166,"5K","LIE","GS",215,2,3]
["2/4/LIE","2/4/5K","2/4/215",2166,"5K","LIE","GS",215,2,4]
["3/7/GRB","3/7/5K","3/7/14",2216,"5K","GRB","KS",14,3,7]
["1/3/CON","1/3/5K","1/3/112",2151,"5K","CON","MA",112,1,3]
["1/4/CON","1/4/5K","1/4/112",2151,"5K","CON","MA",112,1,4]
[{"$f":"CONCATENATE($I1703,\"/\",$J1703,\"/\",$F1703)","v":"4/1/CON"},{"$f":"CONCATENATE($I1703,\"/\",$J1703,\"/\",$E1703)","v":"4/1/5K"},{"$f":"CONCATENATE($I1703,\"/\",$J1703,\"/\",$H1703)","v":"4/1/112"},2151,"5K","CON","MA",112,4,1]
["4/2/CON","4/2/5K","4/2/112",2151,"5K","CON","MA",112,4,2]
["3/9/BRE","3/9/5K","3/9/244",2174,"5K","BRE","PH",244,3,9]
["5/3/BRE","5/3/5K","5/3/244",2174,"5K","BRE","PH",244,5,3]
["2/7/CHI","2/7/5K","2/7/110",2159,"5K","CHI","PS",110,2,7]
["2/8/CHI","2/8/5K","2/8/110",2159,"5K","CHI","PS",110,2,8]
["1/9/MUN","1/9/5L","1/9/N16",2234,"5L","MUN","CH","N16",1,9]
["3/4/LIE","3/4/5L","3/4/215",2222,"5L","LIE","DE",215,3,4]
["4/1/LIE","4/1/5L","4/1/215",2222,"5L","LIE","DE",215,4,1]
["4/2/LIE","4/2/5L","4/2/215",2222,"5L","LIE","DE",215,4,2]
["1/3/PEY","1/3/5L","1/3/12",2224,"5L","PEY","EN",12,1,3]
["1/4/PEY","1/4/5L","1/4/12",2224,"5L","PEY","EN",12,1,4]
["5/1/PEY","5/1/5L","5/1/12",2224,"5L","PEY","EN",12,5,1]
["2/7/BIL","2/7/5L","2/7/206",2223,"5L","BIL","FR",206,2,7]
["2/8/BIL","2/8/5L","2/8/206",2223,"5L","BIL","FR",206,2,8]
["3/3/BIL","3/3/5L","3/3/206",2223,"5L","BIL","FR",206,3,3]
["5/3/LUN","5/3/5L","5/3/103",2241,"5L","LUN","GG",103,5,3]
["5/4/LUN","5/4/5L","5/4/103",2241,"5L","LUN","GG",103,5,4]
["4/9/FIR","4/9/5L","4/9/218",2240,"5L","FIR","GS",218,4,9]
["4/10/FIR","4/10/5L","4/10/218",2240,"5L","FIR","GS",218,4,10]
["5/9/PEY","5/9/5L","5/9/12",2290,"5L","PEY","KS",12,5,9]
["3/7/STA","3/7/5L","3/7/N06",2238,"5L","STA","LN","N06",3,7]
["3/8/STA","3/8/5L","3/8/N06",2238,"5L","STA","LN","N06",3,8]
["3/7/MUN","3/7/5L","3/7/~N16~N13",2238,"5L","MUN","LN","~N16~N13",3,7]
["3/8/MUN","3/8/5L","3/8/~N16~N13",2238,"5L","MUN","LN","~N16~N13",3,8]
["1/1/GUH","1/1/5L","1/1/118",2225,"5L","GUH","MA",118,1,1]
["1/2/GUH","1/2/5L","1/2/118",2225,"5L","GUH","MA",118,1,2]
["3/9/GUH","3/9/5L","3/9/118",2225,"5L","GUH","MA",118,3,9]
["3/10/GUH","3/10/5L","3/10/118",2225,"5L","GUH","MA",118,3,10]
["5/7/BRE","5/7/5L","5/7/244",2248,"5L","BRE","PH",244,5,7]
["5/8/BRE","5/8/5L","5/8/244",2248,"5L","BRE","PH",244,5,8]
["2/3/STM","2/3/5L","2/3/110",2233,"5L","STM","PS",110,2,3]
["2/4/STM","2/4/5L","2/4/110",2233,"5L","STM","PS",110,2,4]
["4/1/STA","4/1/6A","4/1/N06",2305,"6A","STA","BI","N06",4,1]
["4/2/STA","4/2/6A","4/2/N06",2305,"6A","STA","BI","N06",4,2]
["1/9/ZUG","1/9/6A","1/9/213",2296,"6A","ZUG","DE",213,1,9]
["1/10/ZUG","1/10/6A","1/10/213",2296,"6A","ZUG","DE",213,1,10]
["3/1/ZUG","3/1/6A","3/1/219",2296,"6A","ZUG","DE",219,3,1]
["3/2/ZUG","3/2/6A","3/2/219",2296,"6A","ZUG","DE",219,3,2]
["1/3/BUA","1/3/6A","1/3/16",2298,"6A","BUA","EN",16,1,3]
["2/3/BUA","2/3/6A","2/3/16",2298,"6A","BUA","EN",16,2,3]
["2/4/BUA","2/4/6A","2/4/16",2298,"6A","BUA","EN",16,2,4]
["3/9/GRB","3/9/6A","3/9/14",2297,"6A","GRB","FR",14,3,9]
["3/10/GRB","3/10/6A","3/10/14",2297,"6A","GRB","FR",14,3,10]
["5/3/GRB","5/3/6A","5/3/14",2297,"6A","GRB","FR",14,5,3]
["3/7/DIS","3/7/6A","3/7/106",2315,"6A","DIS","GG",106,3,7]
["3/8/DIS","3/8/6A","3/8/106",2315,"6A","DIS","GG",106,3,8]
["3/7/DIS","3/7/6A","3/7/106",2315,"6A","DIS","IF",106,3,7]
["3/8/DIS","3/8/6A","3/8/106",2315,"6A","DIS","IF",106,3,8]
["3/7/FRA","3/7/6A","3/7/106",2315,"6A","FRA","IF",106,3,7]
["3/8/FRA","3/8/6A","3/8/106",2315,"6A","FRA","IF",106,3,8]
["4/7/FIR","4/7/6A","4/7/218",2314,"6A","FIR","GS",218,4,7]
["4/8/FIR","4/8/6A","4/8/218",2314,"6A","FIR","GS",218,4,8]
["1/4/ZUG","1/4/6A","1/4/244",2364,"6A","ZUG","KS",244,1,4]
["1/1/GRA","1/1/6A","1/1/N11",2299,"6A","GRA","MA","N11",1,1]
["1/2/GRA","1/2/6A","1/2/N11",2299,"6A","GRA","MA","N11",1,2]
["4/3/GRA","4/3/6A","4/3/N11",2299,"6A","GRA","MA","N11",4,3]
["4/4/GRA","4/4/6A","4/4/N11",2299,"6A","GRA","MA","N11",4,4]
["4/9/BRE","4/9/6A","4/9/244",2322,"6A","BRE","PH",244,4,9]
["5/4/BRE","5/4/6A","5/4/244",2322,"6A","BRE","PH",244,5,4]
["5/1/CHI","5/1/6A","5/1/107",2307,"6A","CHI","PS",107,5,1]
["5/2/CHI","5/2/6A","5/2/107",2307,"6A","CHI","PS",107,5,2]
["1/1/KAP","1/1/6B","1/1/N06",2379,"6B","KAP","BI","N06",1,1]
["1/2/KAP","1/2/6B","1/2/N06",2379,"6B","KAP","BI","N06",1,2]
[{"$f":"CONCATENATE($I1767,\"/\",$J1767,\"/\",$F1767)","v":"2/3/MOR"},{"$f":"CONCATENATE($I1767,\"/\",$J1767,\"/\",$E1767)","v":"2/3/6B"},{"$f":"CONCATENATE($I1767,\"/\",$J1767,\"/\",$H1767)","v":"2/3/207"},2370,"6B","MOR","DE",207,2,3]
["2/4/MOR","2/4/6B","2/4/207",2370,"6B","MOR","DE",207,2,4]
["5/3/MOR","5/3/6B","5/3/207",2370,"6B","MOR","DE",207,5,3]
["5/4/MOR","5/4/6B","5/4/207",2370,"6B","MOR","DE",207,5,4]
["1/9/LOU","1/9/6B","1/9/15",2372,"6B","LOU","EN",15,1,9]
["4/7/LOU","4/7/6B","4/7/15",2372,"6B","LOU","EN",15,4,7]
["4/8/LOU","4/8/6B","4/8/15",2372,"6B","LOU","EN",15,4,8]
["3/2/GRB","3/2/6B","3/2/14",2371,"6B","GRB","FR",14,3,2]
["4/3/GRB","4/3/6B","4/3/14",2371,"6B","GRB","FR",14,4,3]
["4/4/GRB","4/4/6B","4/4/14",2371,"6B","GRB","FR",14,4,4]
["3/9/WER","3/9/6B","3/9/116",2389,"6B","WER","GG",116,3,9]
["3/10/WER","3/10/6B","3/10/116",2389,"6B","WER","GG",116,3,10]
["3/9/WER","3/9/6B","3/9/116",2389,"6B","WER","IF",116,3,9]
["3/10/WER","3/10/6B","3/10/116",2389,"6B","WER","IF",116,3,10]
["3/9/LIE","3/9/6B","3/9/116",2389,"6B","LIE","IF",116,3,9]
["3/10/LIE","3/10/6B","3/10/116",2389,"6B","LIE","IF",116,3,10]
["5/1/FIR","5/1/6B","5/1/218",2388,"6B","FIR","GS",218,5,1]
["5/2/FIR","5/2/6B","5/2/218",2388,"6B","FIR","GS",218,5,2]
["1/10/GRA","1/10/6B","1/10/N11",2438,"6B","GRA","KS","N11",1,10]
["1/7/GRA","1/7/6B","1/7/N11",2373,"6B","GRA","MA","N11",1,7]
["1/8/GRA","1/8/6B","1/8/N11",2373,"6B","GRA","MA","N11",1,8]
["4/1/GRA","4/1/6B","4/1/N11",2373,"6B","GRA","MA","N11",4,1]
["4/2/GRA","4/2/6B","4/2/N11",2373,"6B","GRA","MA","N11",4,2]
["3/7/BRE","3/7/6B","3/7/244",2396,"6B","BRE","PH",244,3,7]
["3/8/BRE","3/8/6B","3/8/244",2396,"6B","BRE","PH",244,3,8]
["4/9/SRO","4/9/6B","4/9/107",2381,"6B","SRO","PS",107,4,9]
["4/10/SRO","4/10/6B","4/10/107",2381,"6B","SRO","PS",107,4,10]
["2/3/STA","2/3/6C","2/3/N06",2453,"6C","STA","BI","N06",2,3]
["2/4/STA","2/4/6C","2/4/N06",2453,"6C","STA","BI","N06",2,4]
["3/7/SOT","3/7/6C","3/7/212",2444,"6C","SOT","DE",212,3,7]
["3/8/SOT","3/8/6C","3/8/212",2444,"6C","SOT","DE",212,3,8]
["4/1/SOT","4/1/6C","4/1/212",2444,"6C","SOT","DE",212,4,1]
["5/2/SOT","5/2/6C","5/2/212",2444,"6C","SOT","DE",212,5,2]
["2/9/PEY","2/9/6C","2/9/12",2446,"6C","PEY","EN",12,2,9]
["4/7/PEY","4/7/6C","4/7/12",2446,"6C","PEY","EN",12,4,7]
["4/8/PEY","4/8/6C","4/8/12",2446,"6C","PEY","EN",12,4,8]
["1/3/BLU","1/3/6C","1/3/204",2445,"6C","BLU","FR",204,1,3]
["1/4/BLU","1/4/6C","1/4/204",2445,"6C","BLU","FR",204,1,4]
["4/2/BLU","4/2/6C","4/2/204",2445,"6C","BLU","FR",204,4,2]
["4/9/LUN","4/9/6C","4/9/103",2463,"6C","LUN","IF",103,4,9]
["4/10/LUN","4/10/6C","4/10/103",2463,"6C","LUN","IF",103,4,10]
["4/9/LUM","4/9/6C","4/9/103",2463,"6C","LUM","IF",103,4,9]
["4/10/LUM","4/10/6C","4/10/103",2463,"6C","LUM","IF",103,4,10]
["4/9/LUN","4/9/6C","4/9/103",2463,"6C","LUN","GG",103,4,9]
["4/10/LUN","4/10/6C","4/10/103",2463,"6C","LUN","GG",103,4,10]
["1/1/LIE","1/1/6C","1/1/215",2462,"6C","LIE","GS",215,1,1]
["1/2/LIE","1/2/6C","1/2/215",2462,"6C","LIE","GS",215,1,2]
["5/1/SOT","5/1/6C","5/1/212",2512,"6C","SOT","KS",212,5,1]
["1/9/GUH","1/9/6C","1/9/118",2447,"6C","GUH","MA",118,1,9]
["1/10/GUH","1/10/6C","1/10/118",2447,"6C","GUH","MA",118,1,10]
["4/3/GUH","4/3/6C","4/3/118",2447,"6C","GUH","MA",118,4,3]
["4/4/GUH","4/4/6C","4/4/118",2447,"6C","GUH","MA",118,4,4]
["3/1/SWE","3/1/6C","3/1/243",2470,"6C","SWE","PH",243,3,1]
["3/2/SWE","3/2/6C","3/2/243",2470,"6C","SWE","PH",243,3,2]
["5/3/CHI","5/3/6C","5/3/107",2455,"6C","CHI","PS",107,5,3]
["5/4/CHI","5/4/6C","5/4/107",2455,"6C","CHI","PS",107,5,4]
["1/7/WER","1/7/6D","1/7/N12",2527,"6D","WER","BI","N12",1,7]
["1/8/WER","1/8/6D","1/8/N12",2527,"6D","WER","BI","N12",1,8]
["1/3/DEE","1/3/6D","1/3/E52",2518,"6D","DEE","DE","E52",1,3]
["1/4/DEE","1/4/6D","1/4/E52",2518,"6D","DEE","DE","E52",1,4]
["4/1/DEE","4/1/6D","4/1/203",2518,"6D","DEE","DE",203,4,1]
["4/2/DEE","4/2/6D","4/2/203",2518,"6D","DEE","DE",203,4,2]
["1/2/LOU","1/2/6D","1/2/15",2520,"6D","LOU","EN",15,1,2]
["5/3/LOU","5/3/6D","5/3/15",2520,"6D","LOU","EN",15,5,3]
[{"$f":"CONCATENATE($I1831,\"/\",$J1831,\"/\",$F1831)","v":"5/4/LOU"},{"$f":"CONCATENATE($I1831,\"/\",$J1831,\"/\",$E1831)","v":"5/4/6D"},{"$f":"CONCATENATE($I1831,\"/\",$J1831,\"/\",$H1831)","v":"5/4/15"},2520,"6D","LOU","EN",15,5,4]
["1/1/THE","1/1/6D","1/1/202",2519,"6D","THE","FR",202,1,1]
["3/1/THE","3/1/6D","3/1/202",2519,"6D","THE","FR",202,3,1]
["3/2/THE","3/2/6D","3/2/202",2519,"6D","THE","FR",202,3,2]
["3/8/FIR","3/8/6D","3/8/103",2537,"6D","FIR","IF",103,3,8]
["3/9/FIR","3/9/6D","3/9/103",2537,"6D","FIR","IF",103,3,9]
["3/8/FUM","3/8/6D","3/8/103",2537,"6D","FUM","IF",103,3,8]
["3/9/FUM","3/9/6D","3/9/103",2537,"6D","FUM","IF",103,3,9]
["3/8/LUN","3/8/6D","3/8/103",2537,"6D","LUN","GG",103,3,8]
["3/9/LUN","3/9/6D","3/9/103",2537,"6D","LUN","GG",103,3,9]
["4/7/LIE","4/7/6D","4/7/215",2536,"6D","LIE","GS",215,4,7]
["4/8/LIE","4/8/6D","4/8/215",2536,"6D","LIE","GS",215,4,8]
["3/7/WER","3/7/6D","3/7/116",2586,"6D","WER","KS",116,3,7]
["2/3/GEU","2/3/6D","2/3/146",2521,"6D","GEU","MA",146,2,3]
["2/4/GEU","2/4/6D","2/4/146",2521,"6D","GEU","MA",146,2,4]
["5/1/GEU","5/1/6D","5/1/146",2521,"6D","GEU","MA",146,5,1]
["5/2/GEU","5/2/6D","5/2/146",2521,"6D","GEU","MA",146,5,2]
["4/3/SWE","4/3/6D","4/3/243",2544,"6D","SWE","PH",243,4,3]
["4/4/SWE","4/4/6D","4/4/243",2544,"6D","SWE","PH",243,4,4]
["2/9/SRO","2/9/6D","2/9/107",2529,"6D","SRO","PS",107,2,9]
["2/10/SRO","2/10/6D","2/10/107",2529,"6D","SRO","PS",107,2,10]
["1/1/ISE","1/1/6K","1/1/N02",2601,"6K","ISE","BI","N02",1,1]
["1/2/ISE","1/2/6K","1/2/N02",2601,"6K","ISE","BI","N02",1,2]
["2/9/ARN","2/9/6K","2/9/213",2592,"6K","ARN","DE",213,2,9]
["2/10/ARN","2/10/6K","2/10/213",2592,"6K","ARN","DE",213,2,10]
["4/1/ARN","4/1/6K","4/1/213",2592,"6K","ARN","DE",213,4,1]
["4/2/ARN","4/2/6K","4/2/213",2592,"6K","ARN","DE",213,4,2]
["1/7/PEY","1/7/6K","1/7/12",2594,"6K","PEY","EN",12,1,7]
["1/8/PEY","1/8/6K","1/8/12",2594,"6K","PEY","EN",12,1,8]
["3/2/PEY","3/2/6K","3/2/12",2594,"6K","PEY","EN",12,3,2]
["1/9/SPE","1/9/6K","1/9/E51",2593,"6K","SPE","FR","E51",1,9]
["5/1/SPE","5/1/6K","5/1/E51",2593,"6K","SPE","FR","E51",5,1]
["5/2/SPE","5/2/6K","5/2/E51",2593,"6K","SPE","FR","E51",5,2]
["4/9/DIS","4/9/6K","4/9/106",2611,"6K","DIS","GG",106,4,9]
["4/10/DIS","4/10/6K","4/10/106",2611,"6K","DIS","GG",106,4,10]
["4/9/KNE","4/9/6K","4/9/106",2611,"6K","KNE","IF",106,4,9]
["4/10/KNE","4/10/6K","4/10/106",2611,"6K","KNE","IF",106,4,10]
["4/9/ZIH","4/9/6K","4/9/106",2611,"6K","ZIH","IF",106,4,9]
["4/10/ZIH","4/10/6K","4/10/106",2611,"6K","ZIH","IF",106,4,10]
["3/7/LIE","3/7/6K","3/7/215",2610,"6K","LIE","GS",215,3,7]
["3/8/LIE","3/8/6K","3/8/215",2610,"6K","LIE","GS",215,3,8]
["3/1/GUH","3/1/6K","3/1/118",2660,"6K","GUH","KS",118,3,1]
["2/3/GUH","2/3/6K","2/3/118",2595,"6K","GUH","MA",118,2,3]
["2/4/GUH","2/4/6K","2/4/118",2595,"6K","GUH","MA",118,2,4]
["4/7/GUH","4/7/6K","4/7/118",2595,"6K","GUH","MA",118,4,7]
["4/8/GUH","4/8/6K","4/8/118",2595,"6K","GUH","MA",118,4,8]
["5/3/SWE","5/3/6K","5/3/243",2618,"6K","SWE","PH",243,5,3]
["5/4/SWE","5/4/6K","5/4/243",2618,"6K","SWE","PH",243,5,4]
["4/3/SRO","4/3/6K","4/3/107",2603,"6K","SRO","PS",107,4,3]
["4/4/SRO","4/4/6K","4/4/107",2603,"6K","SRO","PS",107,4,4]
["2/3/ISE","2/3/6L","2/3/N02",2675,"6L","ISE","BI","N02",2,3]
["2/4/ISE","2/4/6L","2/4/N02",2675,"6L","ISE","BI","N02",2,4]
["1/1/CLE","1/1/6L","1/1/214",2666,"6L","CLE","DE",214,1,1]
["1/2/CLE","1/2/6L","1/2/214",2666,"6L","CLE","DE",214,1,2]
["4/1/CLE","4/1/6L","4/1/214",2666,"6L","CLE","DE",214,4,1]
["4/2/CLE","4/2/6L","4/2/214",2666,"6L","CLE","DE",214,4,2]
["3/7/SEI","3/7/6L","3/7/15",2668,"6L","SEI","EN",15,3,7]
["4/3/SEI","4/3/6L","4/3/18",2668,"6L","SEI","EN",18,4,3]
["4/4/SEI","4/4/6L","4/4/18",2668,"6L","SEI","EN",18,4,4]
["1/3/MOT","1/3/6L","1/3/217",2667,"6L","MOT","FR",217,1,3]
["1/4/MOT","1/4/6L","1/4/217",2667,"6L","MOT","FR",217,1,4]
["5/2/MOT","5/2/6L","5/2/217",2667,"6L","MOT","FR",217,5,2]
["5/3/FIR","5/3/6L","5/3/218",2684,"6L","FIR","GS",218,5,3]
["5/4/FIR","5/4/6L","5/4/218",2684,"6L","FIR","GS",218,5,4]
[{"$f":"CONCATENATE($I1895,\"/\",$J1895,\"/\",$F1895)","v":"5/1/CLE"},{"$f":"CONCATENATE($I1895,\"/\",$J1895,\"/\",$E1895)","v":"5/1/6L"},{"$f":"CONCATENATE($I1895,\"/\",$J1895,\"/\",$H1895)","v":"5/1/214"},2734,"6L","CLE","KS",214,5,1]
["3/8/RIS","3/8/6L","3/8/110",2682,"6L","RIS","LN",110,3,8]
["3/9/RIS","3/9/6L","3/9/110",2682,"6L","RIS","LN",110,3,9]
["3/10/RIS","3/10/6L","3/10/110",2682,"6L","RIS","LN",110,3,10]
["3/8/STM","3/8/6L","3/8/110",2682,"6L","STM","LN",110,3,8]
["3/9/STM","3/9/6L","3/9/110",2682,"6L","STM","LN",110,3,9]
["3/10/STM","3/10/6L","3/10/110",2682,"6L","STM","LN",110,3,10]
["3/1/GEU","3/1/6L","3/1/146",2669,"6L","GEU","MA",146,3,1]
["3/2/GEU","3/2/6L","3/2/146",2669,"6L","GEU","MA",146,3,2]
["4/9/GEU","4/9/6L","4/9/146",2669,"6L","GEU","MA",146,4,9]
["4/10/GEU","4/10/6L","4/10/146",2669,"6L","GEU","MA",146,4,10]
["4/7/SWE","4/7/6L","4/7/243",2692,"6L","SWE","PH",243,4,7]
["4/8/SWE","4/8/6L","4/8/243",2692,"6L","SWE","PH",243,4,8]
["1/7/STM","1/7/6L","1/7/110",2677,"6L","STM","PS",110,1,7]
["1/8/STM","1/8/6L","1/8/110",2677,"6L","STM","PS",110,1,8]
["3/1/LUS","3/1/F1A","3/1/U45",2760,"F1A","LUS","BG","U45",3,1]
["3/2/LUS","3/2/F1A","3/2/U45",2760,"F1A","LUS","BG","U45",3,2]
["4/3/LUM","4/3/F1A","4/3/N07",2749,"F1A","LUM","BI","N07",4,3]
["4/4/LUM","4/4/F1A","4/4/N07",2749,"F1A","LUM","BI","N07",4,4]
["1/9/BEM","1/9/F1A","1/9/218",2740,"F1A","BEM","DE",218,1,9]
["1/10/BEM","1/10/F1A","1/10/218",2740,"F1A","BEM","DE",218,1,10]
["3/3/BEM","3/3/F1A","3/3/218",2740,"F1A","BEM","DE",218,3,3]
["3/4/BEM","3/4/F1A","3/4/218",2740,"F1A","BEM","DE",218,3,4]
["2/1/BUA","2/1/F1A","2/1/16",2742,"F1A","BUA","EN",16,2,1]
["2/2/BUA","2/2/F1A","2/2/16",2742,"F1A","BUA","EN",16,2,2]
["3/7/BUA","3/7/F1A","3/7/16",2742,"F1A","BUA","EN",16,3,7]
["3/8/BUA","3/8/F1A","3/8/16",2742,"F1A","BUA","EN",16,3,8]
["1/1/ERX","1/1/F1A","1/1/E53",2741,"F1A","ERX","FR","E53",1,1]
["1/2/ERX","1/2/F1A","1/2/E53",2741,"F1A","ERX","FR","E53",1,2]
["4/1/ERX","4/1/F1A","4/1/E53",2741,"F1A","ERX","FR","E53",4,1]
["4/2/ERX","4/2/F1A","4/2/E53",2741,"F1A","ERX","FR","E53",4,2]
["4/7/RUT","4/7/F1A","4/7/116",2759,"F1A","RUT","GG",116,4,7]
["4/8/RUT","4/8/F1A","4/8/116",2759,"F1A","RUT","GG",116,4,8]
["2/3/BIL","2/3/F1A","2/3/206",2758,"F1A","BIL","GS",206,2,3]
["2/4/BIL","2/4/F1A","2/4/206",2758,"F1A","BIL","GS",206,2,4]
["1/4/ERX","1/4/F1A","1/4/E53",2808,"F1A","ERX","KS","E53",1,4]
["1/3/GRA","1/3/F1A","1/3/N11",2743,"F1A","GRA","MA","N11",1,3]
["5/3/GRA","5/3/F1A","5/3/N11",2743,"F1A","GRA","MA","N11",5,3]
["5/4/GRA","5/4/F1A","5/4/N11",2743,"F1A","GRA","MA","N11",5,4]
["1/7/GUT","1/7/F1A","1/7/10",2745,"F1A","GUT","MI",10,1,7]
["1/8/GUT","1/8/F1A","1/8/10",2745,"F1A","GUT","MI",10,1,8]
["1/7/GUT","1/7/F1B","1/7/10",2745,"F1B","GUT","MI",10,1,7]
["1/8/GUT","1/8/F1B","1/8/10",2745,"F1B","GUT","MI",10,1,8]
["1/7/STS","1/7/F1A","1/7/119",2745,"F1A","STS","IN",119,1,7]
["1/8/STS","1/8/F1A","1/8/119",2745,"F1A","STS","IN",119,1,8]
["1/7/STS","1/7/F1B","1/7/119",2745,"F1B","STS","IN",119,1,7]
["1/8/STS","1/8/F1B","1/8/119",2745,"F1B","STS","IN",119,1,8]
["4/10/SAN","4/10/F1A","4/10/22",2764,"F1A","SAN","MU",22,4,10]
["5/7/SAN","5/7/F1A","5/7/22",2764,"F1A","SAN","MU",22,5,7]
["5/8/SAN","5/8/F1A","5/8/22",2764,"F1A","SAN","MU",22,5,8]
["5/1/DIN","5/1/F1A","5/1/110",2751,"F1A","DIN","PS",110,5,1]
["5/2/DIN","5/2/F1A","5/2/110",2751,"F1A","DIN","PS",110,5,2]
["2/7/RUT","2/7/F1A","2/7/TS2",43354,"F1A","RUT","SP","TS2",2,7]
["2/8/RUT","2/8/F1A","2/8/TS2",43354,"F1A","RUT","SP","TS2",2,8]
["4/9/RUT","4/9/F1A","4/9/THU",2775,"F1A","RUT","SP","THU",4,9]
["5/3/BRO","5/3/F1B","5/3/U47",2834,"F1B","BRO","BG","U47",5,3]
["5/4/BRO","5/4/F1B","5/4/U47",2834,"F1B","BRO","BG","U47",5,4]
["2/3/LUM","2/3/F1B","2/3/N07",2823,"F1B","LUM","BI","N07",2,3]
["2/4/LUM","2/4/F1B","2/4/N07",2823,"F1B","LUM","BI","N07",2,4]
["1/3/KOR","1/3/F1B","1/3/213",2814,"F1B","KOR","DE",213,1,3]
["1/4/KOR","1/4/F1B","1/4/213",2814,"F1B","KOR","DE",213,1,4]
["3/7/KOR","3/7/F1B","3/7/214",2814,"F1B","KOR","DE",214,3,7]
[{"$f":"CONCATENATE($I1957,\"/\",$J1957,\"/\",$F1957)","v":"3/8/KOR"},{"$f":"CONCATENATE($I1957,\"/\",$J1957,\"/\",$E1957)","v":"3/8/F1B"},{"$f":"CONCATENATE($I1957,\"/\",$J1957,\"/\",$H1957)","v":"3/8/214"},2814,"F1B","KOR","DE",214,3,8]
["2/7/BUA","2/7/F1B","2/7/16",2816,"F1B","BUA","EN",16,2,7]
["2/8/BUA","2/8/F1B","2/8/16",2816,"F1B","BUA","EN",16,2,8]
["4/1/BUA","4/1/F1B","4/1/16",2816,"F1B","BUA","EN",16,4,1]
["4/2/BUA","4/2/F1B","4/2/16",2816,"F1B","BUA","EN",16,4,2]
["3/3/NEL","3/3/F1B","3/3/E52",2815,"F1B","NEL","FR","E52",3,3]
["3/4/NEL","3/4/F1B","3/4/E52",2815,"F1B","NEL","FR","E52",3,4]
["4/3/NEL","4/3/F1B","4/3/E52",2815,"F1B","NEL","FR","E52",4,3]
["4/8/NEL","4/8/F1B","4/8/E52",2815,"F1B","NEL","FR","E52",4,8]
["2/1/RUT","2/1/F1B","2/1/116",2833,"F1B","RUT","GG",116,2,1]
["2/2/RUT","2/2/F1B","2/2/116",2833,"F1B","RUT","GG",116,2,2]
["3/1/FUM","3/1/F1B","3/1/217",2832,"F1B","FUM","GS",217,3,1]
["3/2/FUM","3/2/F1B","3/2/217",2832,"F1B","FUM","GS",217,3,2]
["4/4/NEL","4/4/F1B","4/4/E52",2882,"F1B","NEL","KS","E52",4,4]
["2/9/GRA","2/9/F1B","2/9/N11",2817,"F1B","GRA","MA","N11",2,9]
["5/1/GRA","5/1/F1B","5/1/N11",2817,"F1B","GRA","MA","N11",5,1]
["5/2/GRA","5/2/F1B","5/2/N11",2817,"F1B","GRA","MA","N11",5,2]
["4/9/SAN","4/9/F1B","4/9/22",2838,"F1B","SAN","MU",22,4,9]
["5/9/SAN","5/9/F1B","5/9/22",2838,"F1B","SAN","MU",22,5,9]
["5/10/SAN","5/10/F1B","5/10/22",2838,"F1B","SAN","MU",22,5,10]
["5/7/DIN","5/7/F1B","5/7/107",2825,"F1B","DIN","PS",107,5,7]
["5/8/DIN","5/8/F1B","5/8/107",2825,"F1B","DIN","PS",107,5,8]
["1/1/GRM","1/1/F1B","1/1/TE2",43356,"F1B","GRM","SP","TE2",1,1]
["1/2/GRM","1/2/F1B","1/2/TE2",43356,"F1B","GRM","SP","TE2",1,2]
["4/7/GRM","4/7/F1B","4/7/THO",2849,"F1B","GRM","SP","THO",4,7]
["5/3/LUS","5/3/F2A","5/3/119",2908,"F2A","LUS","BG",119,5,3]
["5/4/LUS","5/4/F2A","5/4/119",2908,"F2A","LUS","BG",119,5,4]
["5/5/LUS","5/5/F2A","5/5/119",2908,"F2A","LUS","BG",119,5,5]
["2/9/LUM","2/9/F2A","2/9/N07",2897,"F2A","LUM","BI","N07",2,9]
["2/10/LUM","2/10/F2A","2/10/N07",2897,"F2A","LUM","BI","N07",2,10]
["5/7/MUN","5/7/F2A","5/7/N16",2900,"F2A","MUN","CH","N16",5,7]
["5/8/MUN","5/8/F2A","5/8/N16",2900,"F2A","MUN","CH","N16",5,8]
["2/1/BEM","2/1/F2A","2/1/218",2888,"F2A","BEM","DE",218,2,1]
["2/2/BEM","2/2/F2A","2/2/218",2888,"F2A","BEM","DE",218,2,2]
["3/1/BEM","3/1/F2A","3/1/218",2888,"F2A","BEM","DE",218,3,1]
["3/2/BEM","3/2/F2A","3/2/218",2888,"F2A","BEM","DE",218,3,2]
["1/7/ZIH","1/7/F2A","1/7/18",2890,"F2A","ZIH","EN",18,1,7]
["2/7/ZIH","2/7/F2A","2/7/18",2890,"F2A","ZIH","EN",18,2,7]
["2/8/ZIH","2/8/F2A","2/8/18",2890,"F2A","ZIH","EN",18,2,8]
["1/2/THE","1/2/F2A","1/2/202",2889,"F2A","THE","FR",202,1,2]
["3/3/THE","3/3/F2A","3/3/202",2889,"F2A","THE","FR",202,3,3]
["3/4/THE","3/4/F2A","3/4/202",2889,"F2A","THE","FR",202,3,4]
["1/9/GUT","1/9/F2A","1/9/10",2907,"F2A","GUT","MI",10,1,9]
["1/10/GUT","1/10/F2A","1/10/10",2907,"F2A","GUT","MI",10,1,10]
["1/9/GUT","1/9/F2B","1/9/10",2907,"F2B","GUT","MI",10,1,9]
["1/10/GUT","1/10/F2B","1/10/10",2907,"F2B","GUT","MI",10,1,10]
["4/1/FUM","4/1/F2A","4/1/202",2906,"F2A","FUM","GS",202,4,1]
["4/2/FUM","4/2/F2A","4/2/202",2906,"F2A","FUM","GS",202,4,2]
["3/7/WID","3/7/F2A","3/7/144",2891,"F2A","WID","MA",144,3,7]
["5/1/WID","5/1/F2A","5/1/144",2891,"F2A","WID","MA",144,5,1]
["5/2/WID","5/2/F2A","5/2/144",2891,"F2A","WID","MA",144,5,2]
["1/3/EGL","1/3/F2A","1/3/22",2912,"F2A","EGL","MU",22,1,3]
["1/4/EGL","1/4/F2A","1/4/22",2912,"F2A","EGL","MU",22,1,4]
["2/3/MAU","2/3/F2A","2/3/244",2954,"F2A","MAU","PP",244,2,3]
["2/4/MAU","2/4/F2A","2/4/244",2954,"F2A","MAU","PP",244,2,4]
["1/8/RER","1/8/F2A","1/8/245",2918,"F2A","RER","RP",245,1,8]
["3/8/RER","3/8/F2A","3/8/245",2918,"F2A","RER","RP",245,3,8]
["3/9/KRO","3/9/F2A","3/9/THU",43358,"F2A","KRO","SP","THU",3,9]
["4/7/KRO","4/7/F2A","4/7/THU",2923,"F2A","KRO","SP","THU",4,7]
["4/8/KRO","4/8/F2A","4/8/THU",2923,"F2A","KRO","SP","THU",4,8]
["4/3/GER","4/3/F2A","4/3/208",2913,"F2A","GER","WR",208,4,3]
["4/4/GER","4/4/F2A","4/4/208",2913,"F2A","GER","WR",208,4,4]
["5/5/BRO","5/5/F2B","5/5/U47",53472,"F2B","BRO","BG","U47",5,5]
["2/3/BRO","2/3/F2B","2/3/122",2982,"F2B","BRO","BG",122,2,3]
[{"$f":"CONCATENATE($I2021,\"/\",$J2021,\"/\",$F2021)","v":"2/4/BRO"},{"$f":"CONCATENATE($I2021,\"/\",$J2021,\"/\",$E2021)","v":"2/4/F2B"},{"$f":"CONCATENATE($I2021,\"/\",$J2021,\"/\",$H2021)","v":"2/4/122"},2982,"F2B","BRO","BG",122,2,4]
["5/7/LUM","5/7/F2B","5/7/N07",2971,"F2B","LUM","BI","N07",5,7]
["5/8/LUM","5/8/F2B","5/8/N07",2971,"F2B","LUM","BI","N07",5,8]
["5/9/MUN","5/9/F2B","5/9/N16",2974,"F2B","MUN","CH","N16",5,9]
["5/10/MUN","5/10/F2B","5/10/N16",2974,"F2B","MUN","CH","N16",5,10]
["1/7/BEM","1/7/F2B","1/7/218",2962,"F2B","BEM","DE",218,1,7]
["1/8/BEM","1/8/F2B","1/8/218",2962,"F2B","BEM","DE",218,1,8]
["2/7/BEM","2/7/F2B","2/7/218",2962,"F2B","BEM","DE",218,2,7]
["2/8/BEM","2/8/F2B","2/8/218",2962,"F2B","BEM","DE",218,2,8]
["2/9/ZIH","2/9/F2B","2/9/18",2964,"F2B","ZIH","EN",18,2,9]
["4/7/ZIH","4/7/F2B","4/7/18",2964,"F2B","ZIH","EN",18,4,7]
["4/8/ZIH","4/8/F2B","4/8/18",2964,"F2B","ZIH","EN",18,4,8]
["1/2/BLU","1/2/F2B","1/2/204",2963,"F2B","BLU","FR",204,1,2]
["3/1/BLU","3/1/F2B","3/1/204",2963,"F2B","BLU","FR",204,3,1]
["3/2/BLU","3/2/F2B","3/2/204",2963,"F2B","BLU","FR",204,3,2]
["3/3/FUM","3/3/F2B","3/3/217",2980,"F2B","FUM","GS",217,3,3]
["3/4/FUM","3/4/F2B","3/4/217",2980,"F2B","FUM","GS",217,3,4]
["2/10/RUT","2/10/F2B","2/10/114",3030,"F2B","RUT","KS",114,2,10]
["3/8/WID","3/8/F2B","3/8/144",2965,"F2B","WID","MA",144,3,8]
["5/3/WID","5/3/F2B","5/3/144",2965,"F2B","WID","MA",144,5,3]
["5/4/WID","5/4/F2B","5/4/144",2965,"F2B","WID","MA",144,5,4]
["5/1/EGL","5/1/F2B","5/1/222",2986,"F2B","EGL","MU",222,5,1]
["5/2/EGL","5/2/F2B","5/2/222",2986,"F2B","EGL","MU",222,5,2]
["2/1/AMI","2/1/F2B","2/1/202",3028,"F2B","AMI","PP",202,2,1]
["2/2/AMI","2/2/F2B","2/2/202",3028,"F2B","AMI","PP",202,2,2]
["4/1/SWE","4/1/F2B","4/1/243",2992,"F2B","SWE","RP",243,4,1]
["4/2/SWE","4/2/F2B","4/2/243",2992,"F2B","SWE","RP",243,4,2]
["4/3/RUT","4/3/F2B","4/3/THO",43360,"F2B","RUT","SP","THO",4,3]
["4/4/RUT","4/4/F2B","4/4/THO",43360,"F2B","RUT","SP","THO",4,4]
["3/7/RUT","3/7/F2B","3/7/THO",2997,"F2B","RUT","SP","THO",3,7]
["1/3/KUT","1/3/F2B","1/3/208",2987,"F2B","KUT","WR",208,1,3]
["1/4/KUT","1/4/F2B","1/4/208",2987,"F2B","KUT","WR",208,1,4]
["3/6/LUS","3/6/F3A","3/6/U47",3056,"F3A","LUS","BG","U47",3,6]
["3/7/LUS","3/7/F3A","3/7/U47",3056,"F3A","LUS","BG","U47",3,7]
["3/8/LUS","3/8/F3A","3/8/U47",3056,"F3A","LUS","BG","U47",3,8]
["2/9/ISE","2/9/F3A","2/9/N02",3045,"F3A","ISE","BI","N02",2,9]
["2/10/ISE","2/10/F3A","2/10/N02",3045,"F3A","ISE","BI","N02",2,10]
["4/7/CLE","4/7/F3A","4/7/214",3036,"F3A","CLE","DE",214,4,7]
["4/8/CLE","4/8/F3A","4/8/214",3036,"F3A","CLE","DE",214,4,8]
["5/7/CLE","5/7/F3A","5/7/214",3036,"F3A","CLE","DE",214,5,7]
["5/8/CLE","5/8/F3A","5/8/214",3036,"F3A","CLE","DE",214,5,8]
["1/7/LOU","1/7/F3A","1/7/15",3038,"F3A","LOU","EN",15,1,7]
["1/8/LOU","1/8/F3A","1/8/15",3038,"F3A","LOU","EN",15,1,8]
["5/1/LOU","5/1/F3A","5/1/15",3038,"F3A","LOU","EN",15,5,1]
["5/2/LOU","5/2/F3A","5/2/15",3038,"F3A","LOU","EN",15,5,2]
["1/3/ERX","1/3/F3A","1/3/E53",3037,"F3A","ERX","FR","E53",1,3]
["4/3/ERX","4/3/F3A","4/3/E53",3037,"F3A","ERX","FR","E53",4,3]
["4/4/ERX","4/4/F3A","4/4/E53",3037,"F3A","ERX","FR","E53",4,4]
["3/3/DIS","3/3/F3A","3/3/106",3055,"F3A","DIS","GG",106,3,3]
["3/4/DIS","3/4/F3A","3/4/106",3055,"F3A","DIS","GG",106,3,4]
["3/3/DIS","3/3/F3B","3/3/106",3055,"F3B","DIS","GG",106,3,3]
["3/4/DIS","3/4/F3B","3/4/106",3055,"F3B","DIS","GG",106,3,4]
["3/3/MUN","3/3/F3B","3/3/N16",3055,"F3B","MUN","CH","N16",3,3]
["3/4/MUN","3/4/F3B","3/4/N16",3055,"F3B","MUN","CH","N16",3,4]
["3/3/MUN","3/3/F3A","3/3/N16",3055,"F3A","MUN","CH","N16",3,3]
["3/4/MUN","3/4/F3A","3/4/N16",3055,"F3A","MUN","CH","N16",3,4]
["2/7/PEY","2/7/F3A","2/7/12",3054,"F3A","PEY","GS",12,2,7]
["2/8/PEY","2/8/F3A","2/8/12",3054,"F3A","PEY","GS",12,2,8]
["5/3/PEY","5/3/F3A","5/3/12",3054,"F3A","PEY","GS",12,5,3]
["5/9/LOU","5/9/F3A","5/9/15",3104,"F3A","LOU","KS",15,5,9]
["2/3/DIN","2/3/F3A","2/3/107",3039,"F3A","DIN","MA",107,2,3]
["2/4/DIN","2/4/F3A","2/4/107",3039,"F3A","DIN","MA",107,2,4]
["5/4/DIN","5/4/F3A","5/4/113",3039,"F3A","DIN","MA",113,5,4]
["4/1/EGL","4/1/F3A","4/1/222",3060,"F3A","EGL","MU",222,4,1]
[{"$f":"CONCATENATE($I2085,\"/\",$J2085,\"/\",$F2085)","v":"4/2/EGL"},{"$f":"CONCATENATE($I2085,\"/\",$J2085,\"/\",$E2085)","v":"4/2/F3A"},{"$f":"CONCATENATE($I2085,\"/\",$J2085,\"/\",$H2085)","v":"4/2/222"},3060,"F3A","EGL","MU",222,4,2]
["2/1/MAU","2/1/F3A","2/1/244",3102,"F3A","MAU","PP",244,2,1]
["2/2/MAU","2/2/F3A","2/2/244",3102,"F3A","MAU","PP",244,2,2]
["1/1/BLA","1/1/F3A","1/1/TS2",3071,"F3A","BLA","SP","TS2",1,1]
["1/2/BLA","1/2/F3A","1/2/TS2",3071,"F3A","BLA","SP","TS2",1,2]
["1/9/KUT","1/9/F3A","1/9/208",3061,"F3A","KUT","WR",208,1,9]
["1/10/KUT","1/10/F3A","1/10/208",3061,"F3A","KUT","WR",208,1,10]
["1/6/LUS","1/6/F3B","1/6/122",3130,"F3B","LUS","BG",122,1,6]
["1/7/LUS","1/7/F3B","1/7/122",3130,"F3B","LUS","BG",122,1,7]
["1/8/LUS","1/8/F3B","1/8/122",3130,"F3B","LUS","BG",122,1,8]
["5/1/ISE","5/1/F3B","5/1/N02",3119,"F3B","ISE","BI","N02",5,1]
["5/2/ISE","5/2/F3B","5/2/N02",3119,"F3B","ISE","BI","N02",5,2]
["3/1/MUN","3/1/F3A","3/1/N16",3122,"F3A","MUN","CH","N16",3,1]
["3/2/MUN","3/2/F3A","3/2/N16",3122,"F3A","MUN","CH","N16",3,2]
["3/1/MUN","3/1/F3B","3/1/N16",3122,"F3B","MUN","CH","N16",3,1]
["3/2/MUN","3/2/F3B","3/2/N16",3122,"F3B","MUN","CH","N16",3,2]
["4/3/ZUG","4/3/F3B","4/3/216",3110,"F3B","ZUG","DE",216,4,3]
["4/4/ZUG","4/4/F3B","4/4/216",3110,"F3B","ZUG","DE",216,4,4]
["5/3/ZUG","5/3/F3B","5/3/216",3110,"F3B","ZUG","DE",216,5,3]
["5/4/ZUG","5/4/F3B","5/4/216",3110,"F3B","ZUG","DE",216,5,4]
["2/9/HAM","2/9/F3B","2/9/17",3112,"F3B","HAM","EN",17,2,9]
["2/10/HAM","2/10/F3B","2/10/17",3112,"F3B","HAM","EN",17,2,10]
["4/1/HAM","4/1/F3B","4/1/17",3112,"F3B","HAM","EN",17,4,1]
["4/2/HAM","4/2/F3B","4/2/17",3112,"F3B","HAM","EN",17,4,2]
["2/2/BLU","2/2/F3B","2/2/204",3111,"F3B","BLU","FR",204,2,2]
["3/8/BLU","3/8/F3B","3/8/204",3111,"F3B","BLU","FR",204,3,8]
["3/9/BLU","3/9/F3B","3/9/204",3111,"F3B","BLU","FR",204,3,9]
["3/7/FUM","3/7/F3B","3/7/217",3128,"F3B","FUM","GS",217,3,7]
["5/7/FUM","5/7/F3B","5/7/202",3128,"F3B","FUM","GS",202,5,7]
["5/8/FUM","5/8/F3B","5/8/202",3128,"F3B","FUM","GS",202,5,8]
["5/9/LUS","5/9/F3B","5/9/13",3178,"F3B","LUS","KS",13,5,9]
["1/9/GRA","1/9/F3B","1/9/N11",3113,"F3B","GRA","MA","N11",1,9]
["2/7/GRA","2/7/F3B","2/7/N11",3113,"F3B","GRA","MA","N11",2,7]
["2/8/GRA","2/8/F3B","2/8/N11",3113,"F3B","GRA","MA","N11",2,8]
["1/1/EGL","1/1/F3B","1/1/22",3134,"F3B","EGL","MU",22,1,1]
["1/2/EGL","1/2/F3B","1/2/22",3134,"F3B","EGL","MU",22,1,2]
["2/3/AMI","2/3/F3B","2/3/202",3176,"F3B","AMI","PP",202,2,3]
["2/4/AMI","2/4/F3B","2/4/202",3176,"F3B","AMI","PP",202,2,4]
["1/3/BAE","1/3/F3B","1/3/TE2",3145,"F3B","BAE","SP","TE2",1,3]
["1/4/BAE","1/4/F3B","1/4/TE2",3145,"F3B","BAE","SP","TE2",1,4]
["4/7/GER","4/7/F3B","4/7/208",3135,"F3B","GER","WR",208,4,7]
["4/8/GER","4/8/F3B","4/8/208",3135,"F3B","GER","WR",208,4,8]
["5/3/LUM","5/3/F4A","5/3/N07",3193,"F4A","LUM","BI","N07",5,3]
["5/4/LUM","5/4/F4A","5/4/N07",3193,"F4A","LUM","BI","N07",5,4]
["4/1/MUN","4/1/F4A","4/1/N16",3196,"F4A","MUN","CH","N16",4,1]
["4/2/MUN","4/2/F4A","4/2/N16",3196,"F4A","MUN","CH","N16",4,2]
["1/1/BEM","1/1/F4A","1/1/218",3184,"F4A","BEM","DE",218,1,1]
["1/2/BEM","1/2/F4A","1/2/218",3184,"F4A","BEM","DE",218,1,2]
["4/3/BEM","4/3/F4A","4/3/218",3184,"F4A","BEM","DE",218,4,3]
["4/4/BEM","4/4/F4A","4/4/218",3184,"F4A","BEM","DE",218,4,4]
["2/7/NEL","2/7/F4A","2/7/E52",3186,"F4A","NEL","FR","E52",2,7]
["2/8/NEL","2/8/F4A","2/8/E52",3186,"F4A","NEL","FR","E52",2,8]
["2/7/NEL","2/7/F4B","2/7/E52",3186,"F4B","NEL","FR","E52",2,7]
["2/8/NEL","2/8/F4B","2/8/E52",3186,"F4B","NEL","FR","E52",2,8]
["2/1/KUR","2/1/F4A","2/1/13",3203,"F4A","KUR","GG",13,2,1]
["2/2/KUR","2/2/F4A","2/2/13",3203,"F4A","KUR","GG",13,2,2]
["1/3/KNE","1/3/F4A","1/3/115",3202,"F4A","KNE","GS",115,1,3]
["1/4/KNE","1/4/F4A","1/4/115",3202,"F4A","KNE","GS",115,1,4]
["2/3/GRA","2/3/F4A","2/3/N11",3187,"F4A","GRA","MA","N11",2,3]
["2/4/GRA","2/4/F4A","2/4/N11",3187,"F4A","GRA","MA","N11",2,4]
["5/7/GRA","5/7/F4A","5/7/113",3187,"F4A","GRA","MA",113,5,7]
["5/8/GRA","5/8/F4A","5/8/113",3187,"F4A","GRA","MA",113,5,8]
["3/1/CHI","3/1/F4A","3/1/110",43388,"F4A","CHI","PS",110,3,1]
["3/2/CHI","3/2/F4A","3/2/110",43388,"F4A","CHI","PS",110,3,2]
[{"$f":"CONCATENATE($I2149,\"/\",$J2149,\"/\",$F2149)","v":"5/1/LUM"},{"$f":"CONCATENATE($I2149,\"/\",$J2149,\"/\",$E2149)","v":"5/1/F4B"},{"$f":"CONCATENATE($I2149,\"/\",$J2149,\"/\",$H2149)","v":"5/1/N07"},3267,"F4B","LUM","BI","N07",5,1]
["5/2/LUM","5/2/F4B","5/2/N07",3267,"F4B","LUM","BI","N07",5,2]
["4/3/MUN","4/3/F4B","4/3/N16",3270,"F4B","MUN","CH","N16",4,3]
["4/4/MUN","4/4/F4B","4/4/N16",3270,"F4B","MUN","CH","N16",4,4]
["1/3/BEM","1/3/F4B","1/3/218",3258,"F4B","BEM","DE",218,1,3]
["1/4/BEM","1/4/F4B","1/4/218",3258,"F4B","BEM","DE",218,1,4]
["4/1/BEM","4/1/F4B","4/1/219",3258,"F4B","BEM","DE",219,4,1]
["4/2/BEM","4/2/F4B","4/2/219",3258,"F4B","BEM","DE",219,4,2]
["3/1/HAM","3/1/F4B","3/1/17",3260,"F4B","HAM","EN",17,3,1]
["3/2/HAM","3/2/F4B","3/2/17",3260,"F4B","HAM","EN",17,3,2]
["5/3/HAM","5/3/F4B","5/3/17",3260,"F4B","HAM","EN",17,5,3]
["5/4/HAM","5/4/F4B","5/4/17",3260,"F4B","HAM","EN",17,5,4]
["2/3/KUR","2/3/F4B","2/3/13",3277,"F4B","KUR","GG",13,2,3]
["2/4/KUR","2/4/F4B","2/4/13",3277,"F4B","KUR","GG",13,2,4]
["1/1/KNE","1/1/F4B","1/1/115",3276,"F4B","KNE","GS",115,1,1]
["1/2/KNE","1/2/F4B","1/2/115",3276,"F4B","KNE","GS",115,1,2]
["2/1/GRA","2/1/F4B","2/1/N11",3261,"F4B","GRA","MA","N11",2,1]
["2/2/GRA","2/2/F4B","2/2/N11",3261,"F4B","GRA","MA","N11",2,2]
["4/7/GRA","4/7/F4B","4/7/N11",3261,"F4B","GRA","MA","N11",4,7]
["4/8/GRA","4/8/F4B","4/8/N11",3261,"F4B","GRA","MA","N11",4,8]
["3/3/CHI","3/3/F4B","3/3/110",43390,"F4B","CHI","PS",110,3,3]
["3/4/CHI","3/4/F4B","3/4/110",43390,"F4B","CHI","PS",110,3,4]
["1/7/CHI","1/7/F4B","1/7/107",3269,"F4B","CHI","PS",107,1,7]
["1/8/CHI","1/8/F4B","1/8/107",3269,"F4B","CHI","PS",107,1,8]
["1/7/CHI","1/7/F4A","1/7/107",3269,"F4A","CHI","PS",107,1,7]
["1/8/CHI","1/8/F4A","1/8/107",3269,"F4A","CHI","PS",107,1,8]
["1/5/KUR","1/5/FKL","1/5/13",3334,"FKL","KUR","FENC",13,1,5]
["5/6/KUR","5/6/FKL","5/6/13",13334,"FKL","KUR","FENP",13,5,6]
["1/6/BUA","1/6/FKL","1/6/16",23334,"FKL","BUA","FENP",16,1,6]
["3/6/BUA","3/6/FKL","3/6/16",33334,"FKL","BUA","FENA",16,3,6]
["4/5/PEY","4/5/FKL","4/5/12",43334,"FKL","PEY","FENA",12,4,5]
["2/5/THM","2/5/FKL","2/5/222",3356,"FKL","THM","FKCO",222,2,5]
["2/6/THM","2/6/FKL","2/6/222",3356,"FKL","THM","FKCO",222,2,6]
["2/5/UNT","2/5/FKL","2/5/119",3356,"FKL","UNT","FKCO",119,2,5]
["2/6/UNT","2/6/FKL","2/6/119",3356,"FKL","UNT","FKCO",119,2,6]
["3/5/BEL","3/5/FKL","3/5/22",13356,"FKL","BEL","FKOR",22,3,5]
["3/6/BEL","3/6/FKL","3/6/22",13356,"FKL","BEL","FKOR",22,3,6]
["4/5/UNT","4/5/FKL","4/5/22",33356,"FKL","UNT","FKEN",22,4,5]
[{"$f":"CONCATENATE($I2187,\"/\",$J2187,\"/\",$F2187)","v":"4/6/UNT"},{"$f":"CONCATENATE($I2187,\"/\",$J2187,\"/\",$E2187)","v":"4/6/FKL"},{"$f":"CONCATENATE($I2187,\"/\",$J2187,\"/\",$H2187)","v":"4/6/22"},33356,"FKL","UNT","FKEN",22,4,6]
["4/10/RUT","4/10/2B","4/10/THU",43383,"2B","RUT","SD","THU",4,10]
["4/10/RUT","4/10/2E","4/10/THU",43383,"2E","RUT","SD","THU",4,10]
["4/6/KRO","4/6/4B","4/6/THO",43384,"4B","KRO","SD","THO",4,6]
["4/9/KRO","4/9/4C","4/9/THO",43385,"4C","KRO","SD","THO",4,9]
["4/9/KRO","4/9/4L","4/9/THO",43385,"4L","KRO","SD","THO",4,9]
["5/10/BAE","5/10/3K","5/10/THO",43386,"3K","BAE","SD","THO",5,10]
["3/3/HAM","3/3/F4A","3/3/17",43391,"F4A","HAM","EN",17,3,3]
["3/4/HAM","3/4/F4A","3/4/17",43391,"F4A","HAM","EN",17,3,4]
["5/1/HAM","5/1/F4A","5/1/17",43391,"F4A","HAM","EN",17,5,1]
["5/2/HAM","5/2/F4A","5/2/17",43391,"F4A","HAM","EN",17,5,2]
["5/10/BLA","5/10/1A","5/10/THU",43392,"1A","BLA","SD","THU",5,10]
["5/10/BLA","5/10/1B","5/10/THU",43392,"1B","BLA","SD","THU",5,10]
["5/5/ERX","5/5/F4A","5/5/E53",43413,"F4A","ERX","FR","E53",5,5]
["5/6/ERX","5/6/F4A","5/6/E53",43413,"F4A","ERX","FR","E53",5,6]
["5/5/ERX","5/5/F4B","5/5/E53",43413,"F4B","ERX","FR","E53",5,5]
["5/6/ERX","5/6/F4B","5/6/E53",43413,"F4B","ERX","FR","E53",5,6]
["4/11/OCK","4/11/FKL","4/11/AUL",53399,"FKL","OCK","FTH1","AUL",4,11]
["1/11/OCK","1/11/FKL","1/11/AUL",53400,"FKL","OCK","FTH2","AUL",1,11]
["3/5/STA","3/5/FKL","3/5/",53401,"FKL","STA","FTER",null,3,5]
["5/5/STA","5/5/FKL","5/5/",53401,"FKL","STA","FTER",null,5,5]
["4/5/GHE","4/5/FKL","4/5/10",53402,"FKL","GHE","FIN1",10,4,5]
["5/5/FIR","5/5/FKL","5/5/218",53403,"FKL","FIR","FPWG",218,5,5]
["1/5/DOS","1/5/FKL","1/5/143",53404,"FKL","DOS","FES1",143,1,5]
["3/6/DOS","3/6/FKL","3/6/143",53404,"FKL","DOS","FES1",143,3,6]
["1/6/DOS","1/6/FKL","1/6/143",53405,"FKL","DOS","FES2",143,1,6]
["3/5/DOS","3/5/FKL","3/5/143",53405,"FKL","DOS","FES2",143,3,5]
["4/5/DOS","4/5/FKL","4/5/143",53435,"FKL","DOS","FES3",143,4,5]
["4/6/DOS","4/6/FKL","4/6/143",53406,"FKL","DOS","FES3",143,4,6]
["1/5/THE","1/5/FKL","1/5/202",53407,"FKL","THE","FLA1",202,1,5]
["3/6/THE","3/6/FKL","3/6/202",53407,"FKL","THE","FLA1",202,3,6]
["1/5/BLA","1/5/FKL","1/5/TS1",53408,"FKL","BLA","FBAD","TS1",1,5]
["1/5/STS","1/5/FKL","1/5/THO",53409,"FKL","STS","FBAB","THO",1,5]
["1/5/STS","1/5/FKL","1/5/~THO~THU",53409,"FKL","STS","FTE2","~THO~THU",1,5]
["4/5/STU","4/5/FKL","4/5/THU",53440,"FKL","STU","FBEV","THU",4,5]
["4/5/STU","4/5/FKL","4/5/THU",53440,"FKL","STU","FKLE","THU",4,5]
["5/5/STU","5/5/FKL","5/5/THU",53442,"FKL","STU","FBEV","THU",5,5]
["5/5/STU","5/5/FKL","5/5/THU",53442,"FKL","STU","FBEV","THU",5,5]
["4/6/STU","4/6/FKL","4/6/THU",53444,"FKL","STU","FBEV","THU",4,6]
["3/6/KRO","3/6/FKL","3/6/THU",53458,"FKL","KRO","FBUR","THU",3,6]
["3/6/KRO","3/6/FKL","3/6/TKR",53458,"FKL","KRO","FKRD","TKR",3,6]
["4/5/KRO","4/5/FKL","4/5/THO",53460,"FKL","KRO","FBUR","THO",4,5]
["4/5/KRO","4/5/FKL","4/5/THO",53460,"FKL","KRO","FBUR","THO",4,5]
["2/6/KRO","2/6/FKL","2/6/THU",53462,"FKL","KRO","FCRO","THU",2,6]
["2/6/KRO","2/6/FKL","2/6/THU",53462,"FKL","KRO","FBUR","THU",2,6]
["2/5/STU","2/5/FKL","2/5/TE1",53413,"FKL","STU","FEHO","TE1",2,5]
["1/5/BAE","1/5/FKL","1/5/TE1",53414,"FKL","BAE","FELA","TE1",1,5]
["3/5/GRM","3/5/FKL","3/5/~TS1~TS2",53415,"FKL","GRM","FFUD","~TS1~TS2",3,5]
["3/5/GRM","3/5/FKL","3/5/~TS1~TS2",53415,"FKL","GRM","FFUH","~TS1~TS2",3,5]
["2/5/GRM","2/5/FKL","2/5/~TS1~TS2",53416,"FKL","GRM","FFUH","~TS1~TS2",2,5]
["1/6/WEY","1/6/FKL","1/6/THO",53452,"FKL","WEY","FGRT","THO",1,6]
["1/6/WEY","1/6/FKL","1/6/~THO~THU",53452,"FKL","WEY","FTE1","~THO~THU",1,6]
["1/5/STU","1/5/FKL","1/5/THU",53438,"FKL","STU","FKLE","THU",1,5]
["1/6/KRO","1/6/FKL","1/6/TKR",53419,"FKL","KRO","FKRD","TKR",1,6]
["1/6/KRO","1/6/FKL","1/6/",53419,"FKL","KRO","FKTF",null,1,6]
["3/5/KRO","3/5/FKL","3/5/TKR",53420,"FKL","KRO","FKRH","TKR",3,5]
["3/5/KRO","3/5/FKL","3/5/THU",53420,"FKL","KRO","FCRO","THU",3,5]
["2/6/RUT","2/6/FKL","2/6/THO",53446,"FKL","RUT","FLEP","THO",2,6]
["4/6/WEY","4/6/FKL","4/6/THU",53425,"FKL","WEY","FTTE","THU",4,6]
["2/5/WEY","2/5/FKL","2/5/THO",53454,"FKL","WEY","FTGT","THO",2,5]
["2/5/WEY","2/5/FKL","2/5/THO",53454,"FKL","WEY","FGRT","THO",2,5]
["3/5/WEY","3/5/FKL","3/5/~THU~THO",53426,"FKL","WEY","FTE1","~THU~THO",3,5]
[{"$f":"CONCATENATE($I2249,\"/\",$J2249,\"/\",$F2249)","v":"3/5/WEY"},{"$f":"CONCATENATE($I2249,\"/\",$J2249,\"/\",$E2249)","v":"3/5/FKL"},{"$f":"CONCATENATE($I2249,\"/\",$J2249,\"/\",$H2249)","v":"3/5/THO"},53426,"FKL","WEY","FTGT","THO",3,5]
["1/6/CAS","1/6/FKL","1/6/THU",53428,"FKL","CAS","FVOL","THU",1,6]
[{"$f":"CONCATENATE($I2251,\"/\",$J2251,\"/\",$F2251)","v":"1/6/CAS"},{"$f":"CONCATENATE($I2251,\"/\",$J2251,\"/\",$E2251)","v":"1/6/FKL"},{"$f":"CONCATENATE($I2251,\"/\",$J2251,\"/\",$H2251)","v":"1/6/TS1"},53428,"FKL","CAS","FUHO","TS1",1,6]
["1/5/RUT","1/5/FKL","1/5/222",53448,"FKL","RUT","FYOG",222,1,5]
["1/5/RUT","1/5/FKL","1/5/222",53448,"FKL","RUT","FYOG",222,1,5]
["3/6/RUT","3/6/FKL","3/6/222",53450,"FKL","RUT","FYOG",222,3,6]
["3/6/RUT","3/6/FKL","3/6/THO",53450,"FKL","RUT","FLEP","THO",3,6]
["1/6/RUT","1/6/FKL","1/6/222",53429,"FKL","RUT","FYOG",222,1,6]
["5/9/DIS","5/9/F2A","5/9/106",53432,"F2A","DIS","GG",106,5,9]
["5/10/DIS","5/10/F2A","5/10/106",53432,"F2A","DIS","GG",106,5,10]
["3/9/DIS","3/9/F2B","3/9/106",53430,"F2B","DIS","GG",106,3,9]
["3/10/DIS","3/10/F2B","3/10/106",53430,"F2B","DIS","GG",106,3,10]
["3/10/KRO","3/10/3L","3/10/THO",53433,"3L","KRO","SD","THO",3,10]
["5/5/STS","5/5/","5/5/THO",53436,null,"STS",null,"THO",5,5]
["4/5/BLU","4/5/2A","4/5/204",53475,"2A","BLU","LA",204,4,5]
["3/5/THE","3/5/2B","3/5/202",53476,"2B","THE","LA",202,3,5]
["1/5/KRO","1/5/F2A","1/5/15",53477,"F2A","KRO","KS",15,1,5]
[{"$f":"CONCATENATE($I2266,\"/\",$J2266,\"/\",$F2266)","v":"4/9/SAR"},{"$f":"CONCATENATE($I2266,\"/\",$J2266,\"/\",$E2266)","v":"4/9/6D"},{"$f":"CONCATENATE($I2266,\"/\",$J2266,\"/\",$H2266)","v":"4/9/210"},98044,"6D","SAR","SWR",210,4,9]
["4/10/SAR","4/10/6D","4/10/210",98044,"6D","SAR","SWR",210,4,10]
[{"$f":"CONCATENATE($I2268,\"/\",$J2268,\"/\",$F2268)","v":"4/5/MOR"},{"$f":"CONCATENATE($I2268,\"/\",$J2268,\"/\",$E2268)","v":"4/5/3C"},{"$f":"CONCATENATE($I2268,\"/\",$J2268,\"/\",$H2268)","v":"4/5/207"},98045,"3C","MOR","BADE",207,4,5]

{"sheet":"GPU004","index":3,"n_rows":98,"n_cols":2,"rows_kept":98,"cut":false,"hidden":true,"merged":[]}
["AMI","AMICO FLAVIA"]
["ARN","ARNET MATTHIAS"]
["BAE","BALMER EVELYNE"]
["BAS","BASCHUNG-SCHNYDER FRANZISKA"]
["BAU","BAUMGARTNER MIRJAM"]
["BEL","BELTRANI MARCO"]
["BEM","BERGER MONIKA"]
["BIL","BILAND SUSANNA"]
["BLA","BLÄTTLER BENNO"]
["BLU","BLUM MICHAEL"]
["BRE","BRENTINI FABRIZIO"]
["BRG","BREGNARD THIERRY"]
["BRN","BRÜNDLER URSULA"]
["BRO","BRODER BARBARA"]
["BUA","BÜCHEL ADRIAN"]
["BUD","BUDMIGER SAMUEL"]
["BUR","BURKARD NICOLE"]
["CAS","CASPARIS CLAUDINE"]
["CHI","CHIANTESE STEFANO"]
["CLE","CLEMENS THOMAS"]
["CON","CONRARDY RICHARD"]
["DEE","DEEG STEFAN"]
["DIN","D'INCAU RENATO"]
["DIS","DISLER SEVERIN"]
["DOS","DOS SANTOS LAURA"]
["EGL","EGLI PETER"]
["ERX","ERNI XENIA"]
["FAN","FANGER FELICITAS"]
["FIR","FISCHER RAFFAEL"]
["FIS","FISCHLIN MORITZ"]
["FRA","FRANK BENNO"]
["FRE","FREIHOFER CHRISTOPH"]
["FUM","FUCHS MARKUS"]
["GER","GERHARDT ULRIKE"]
["GEU","GEISER URS"]
["GHE","GHEZAL ABDELHAKIM"]
["GLA","GLANZMANN RUTH"]
["GRA","GRÄFF TOBIAS"]
["GRB","GRABHER KARIN"]
["GRF","GRAF MANUELA"]
["GRM","GRABER MARTIN"]
["GRU","GRÜTER DAVID"]
["GUH","GÜHR MARCEL"]
["GUT","GUT ANDREAS"]
["HAM","HAMMER SUSANNE"]
["HAN","HANSRAJ SHABIR"]
["HAU","HÄUSLER BEAT"]
["HUJ","HUNN JASMIN"]
["ISE","ISENEGGER CHRISTOPH"]
["KAP","KÄPPELI WOLFGANG"]
["KAU","KAUFMANN ANNA"]
["KNE","KNEUBÜHLER MARKUS"]
["KOR","KORTHUS RAHEL"]
["KRO","KRONENBERG MANUELA"]
["KUR","KURMANN RENE"]
["KUT","KÜTTEL JANINE"]
["LIE","LIENERT DAVID"]
["LOU","LOUIS GABRIELA"]
["LUM","LUSSI MATTHIAS"]
["LUN","LUSSER NIKLAUS"]
["LUS","LUSSI RENATA"]
["MAU","MAUDERLI DONATINA"]
["MEZ","MEZ KONSTANZE"]
["MOR","MORACH OLIVER"]
["MOT","MOTZ ROGER"]
["MUN","MUNDWILER STEFAN"]
["NEL","NELLEN MICHAEL"]
["OCK","OCKENFELS DIETER"]
["PEY","PEYER ISO"]
["RER","REGLI ROBERT"]
["RIS","RIS DANIEL"]
["RUT","RUTZ ALAIN"]
["SAL","SALUZ LADINA"]
["SAN","SANDEL SCOTT"]
["SAR","SCHÄRER LOTHAR"]
["SEI","SCHEIDEGGER FRANZISKA"]
["SIE","SIEGENTHALER CHRISTIAN"]
["SMN","SCHMID NATALIE"]
["SOT","SÖDER THOMAS"]
["SPE","SPERDUTO DONATO"]
["SRO","SROMICKI JERZY"]
["STA","STADLER DAVID"]
["STC","STUCKI CHRISTIAN"]
["STF","STEINER FLORIAN"]
["STM","STEIGER MARTIN"]
["STS","STALDER-BÜHLER STANJA"]
["STU","STUDER PATRICK"]
["SWE","SCHWEIZER HERBERT"]
["THE","THÉVENAZ MODESTIN CLÉMENCE"]
["THM","THÜRIG MARIO"]
["UNT","UNTERNÄHRER GERHARD"]
["VIV","VIVOT ANGELA"]
["WER","WERNLI ROGER"]
["WEY","WEY MARCEL"]
["WID","WIDMER MARINA"]
["ZEM","ZEMP ELIANE"]
["ZIH","ZIHLMANN MARKUS"]
["ZUG","ZÜGER MARKUS"]