{"text_format":"1","workbook":"xlsx","n_sheets":4,"sheets":["Gesuch","Vertretung","GPU001","GPU004"],"not_rendered":{"charts":0,"images":0,"macros":1,"external_links":0,"defined_names":3,"comments":0,"pivot_tables":0},"unopened":[],"bounds":{"document_bytes":16777216,"sheet_cells":100000,"rows_first":2000,"rows_last":500,"rows_between":2000,"halvings":0,"cell_chars":16384,"cell_head_chars":4096},"cells_cut":0,"cells_raw":0,"read":"whole","date_system":"1900"}

{"sheet":"Gesuch","index":0,"n_rows":63,"n_cols":24,"rows_kept":63,"cut":false,"hidden":false,"merged":[[5,14,5,23],[37,17,37,23],[10,7,10,8],[10,14,10,15],[25,17,25,23],[35,7,35,23],[12,14,12,23],[14,14,14,23],[16,14,16,23],[18,14,18,23],[33,7,33,23],[37,7,37,8],[20,14,20,23],[58,7,58,8],[58,17,58,23],[27,17,27,23],[29,17,29,23],[31,17,31,23],[46,14,46,15],[54,7,54,23],[56,7,56,23],[46,7,46,8],[48,7,48,23],[43,14,43,23]]}
["mail@kssursee.ch;stundenplaner@kssursee.ch",null,"Kantonsschule Sursee",null,null,null,null,null,null,null,null,null,null,null,null,null,null,null,null,null,null,null,null,"Urlaubsgesuch"]
[]
[null,null,"URLAUB FÜR LEHRPERSONEN"]
[]
[null,null,null,null,null,null,null,"Kürzel",null,null,null,null,null,null,"Name, Vorname"]
[null,null,"Lehrperson",null,null,null,null,null,null,null,null,null,null,null,{"$f":"IF(ISERROR(VLOOKUP(H6,'GPU004'!A:B,2,FALSE)),\"\",VLOOKUP(H6,'GPU004'!A:B,2,FALSE))","v":""}]
[]
[null,null,"wünscht Urlaub für",null,null,null,null,null,"Tag(e)",null,null,null,null,null,null,"Stunde(n)"]
[]
[null,null,null,null,null,null,null,"Datum",null,null,"Std",null,null,null,"Datum",null,null,"Std",null,null,null,null,null,"Abgabetermin"]
[null,null,"nämlich ",null,null,"vom ",null,null,null,null,null,null,null,"bis ",null,null,null,null,null,null,null,null,null,{"$f":"IF(H11=\"\",\"\",H11-WEEKDAY(H11)+2-7)","v":""}]
[]
[null,null,"Grund",null,null,null,null,"Private Gründe:"]
[]
[null,null,null,null,null,null,null,"Militär, Zivilschutz:"]
[]
[null,null,null,null,null,null,null,"Weiterbildung:"]
[]
[null,null,null,null,null,null,null,"Expertentätigkeit:"]
[]
{"$rows_left_out":44}
{"sheet":"Vertretung","index":1,"n_rows":74,"n_cols":44,"rows_kept":74,"cut":false,"hidden":false,"merged":[[2,13,2,24],[70,6,70,7],[70,16,70,24],[9,6,9,24],[5,6,5,7],[5,13,5,14],[7,6,7,24]]}
["mail@kssursee.ch;stundenplaner@kssursee.ch",null,"Kantonsschule Sursee",null,null,null,null,null,null,null,null,null,null,null,null,null,null,null,null,null,null,null,null,null,"Vertretungsplanung",null,null,null,null,"Monat ",9,"Jahr",2019,null,null,null,{"$f":"11*WEEKDAY(G6)+J6-8","v":69},{"$f":"11*WEEKDAY(N6)+Q6-8","v":69}]
[null,null,null,null,null,null,"Kürzel",null,null,null,null,null,null,"Name, Vorname",null,null,null,null,null,null,null,null,null,null,null,null,null,null,null,null,null,null,null,null,null,null,{"$f":"WEEKDAY(DATE(AG1,AE1,1))","v":1},{"$f":"DATE(AG1,AE1+1,1)-DATE(AG1,AE1,1)","v":30}]
[null,null,"Lehrperson:",null,null,null,null,null,null,null,null,null,null,{"$f":"IF(ISERROR(VLOOKUP(G3,'GPU004'!A:B,2,FALSE)),\"\",VLOOKUP(G3,'GPU004'!A:B,2,FALSE))","v":""},null,null,null,null,null,null,null,null,null,null,null,null,null,null,null,"So","Mo","Di","Mi",null,null,"Do","Fr","Sa"]
[]
[null,null,null,null,null,null,"Datum",null,null,"Std",null,null,null,"Datum",null,null,"Std",null,null,null,null,null,"Abgabetermin",null,null,null,null,null,null,{"$f":"IF(2-AK$2<=0,\"\",2-AK$2)","v":1},{"$f":"IF(3-AK$2<=0,\"\",3-AK$2)","v":2},{"$f":"IF(4-AK$2<=0,\"\",4-AK$2)","v":3},{"$f":"IF(5-AK$2<=0,\"\",5-AK$2)","v":4},null,null,{"$f":"IF(6-AK$2<=0,\"\",6-AK$2)","v":5},{"$f":"IF(7-AK$2<=0,\"\",7-AK$2)","v":6},{"$f":"IF(8-AK$2<=0,\"\",8-AK$2)","v":7}]
[null,null,"ist abwesend",null,null,"vom ",null,null,null,null,null,null,"bis ",null,null,null,null,null,null,null,null,null,{"$f":"IF(G6=\"\",\"\",G6-WEEKDAY(G6)+2-7)","v":""},null,{"$f":"IF(W6<TODAY(),\"verspätet\",\"\")","v":""},null,null,null,null,{"$f":"AL5+1","v":8},{"$f":"AD6+1","v":9},{"$f":"AE6+1","v":10},{"$f":"AF6+1","v":11},null,null,{"$f":"AG6+1","v":12},{"$f":"AJ6+1","v":13},{"$f":"AK6+1","v":14}]
[null,null,null,null,null,null,null,null,null,null,null,null,null,null,null,null,null,null,null,null,null,null,null,null,null,null,null,null,null,{"$f":"AD6+7","v":15},16,17,18,null,null,{"$f":"AJ6+7","v":19},20,21]
[null,null,"Grund",null,null,null,null,null,null,null,null,null,null,null,null,null,null,null,null,null,null,null,null,null,null,null,null,null,null,22,23,24,25,null,null,26,27,28]
[null,null,null,null,null,null,null,null,null,null,null,null,null,null,null,null,null,null,null,null,null,null,null,null,null,null,null,null,null,{"$f":"IF(AD7+14>AL$2,\"\",AD7+14)","v":29},{"$f":"IF(AE7+14>AL$2,\"\",AE7+14)","v":30},{"$f":"IF(AF7+14>AL$2,\"\",AF7+14)","v":""},{"$f":"IF(AG7+14>AL$2,\"\",AG7+14)","v":""},null,null,{"$f":"IF(AJ7+14>AL$2,\"\",AJ7+14)","v":""},{"$f":"IF(AK7+14>AL$2,\"\",AK7+14)","v":""},{"$f":"IF(AL7+14>AL$2,\"\",AL7+14)","v":""}]
[null,null,"Bei Rückfragen Tel",null,null,null,null,null,null,null,null,null,null,null,null,null,null,null,null,null,null,null,null,null,null,null,null,null,null,{"$f":"IF(AD8+14>AL$2,\"\",AD8+14)","v":""},{"$f":"IF(AE8+14>AL$2,\"\",AE8+14)","v":""},{"$f":"IF(AF8+14>AL$2,\"\",AF8+14)","v":""},{"$f":"IF(AG8+14>AL$2,\"\",AG8+14)","v":""},null,null,{"$f":"IF(AJ8+14>AL$2,\"\",AJ8+14)","v":""},{"$f":"IF(AK8+14>AL$2,\"\",AK8+14)","v":""},{"$f":"IF(AL8+14>AL$2,\"\",AL8+14)","v":""}]
[]
[null,null,null,null,"Normalplan",null,null,null,null,"Entsch. Planer",null,null,"Ersatzplan",null,null,null,"Stillbesch.",null,"Aufs.",null,"Ausfall",null,"Bemerkung",null,"Ent. SL","korrekt",null,null,null,"Plan Klasse","1a",null,null,null,null,"Plan Lehrer","arn",null,null,null,null,"Plan Raum",10]
[null,null,"Datum","Tag","(Kl)","(Le)","(Fa)","(Zi)",null,"x",null,"Kl","Le","Fa","Zi",null,"x",null,"Le",null,"x"]
[]
[{"$f":"CONCATENATE(\"1/1/\",$G$3)","v":"1/1/"},{"$f":"(ISERROR(VLOOKUP($A15,'GPU001'!$A:$J,6,FALSE)))","v":true},{"$f":"IF(ISBLANK(G6),\"\",G6-WEEKDAY(G6)+2)","v":""},"Mo 1",{"$f":"IF($B15,\"\",VLOOKUP($A15,'GPU001'!$A:$J,5,FALSE))","v":""},{"$f":"IF($B15,\"\",VLOOKUP($A15,'GPU001'!$A:$J,6,FALSE))","v":""},{"$f":"IF($B15,\"\",VLOOKUP($A15,'GPU001'!$A:$J,7,FALSE))","v":""},{"$f":"IF($B15,\"\",VLOOKUP($A15,'GPU001'!$A:$J,8,FALSE))","v":""},null,null,null,null,null,null,null,null,null,null,null,null,null,null,null,null,null,{"$f":"IF(IF(E15=\"\",FALSE,AND(ROW()>=$AK$1,ROW()<=$AL$1)),IF(AND(AND(ISBLANK(J15),ISBLANK(S15),ISBLANK(U15),ISBLANK(Q15)),OR(ISBLANK(M15),ISBLANK(N15))),\"offen\",\"i.O.\"),\"\")","v":""},null,{"$f":"CONCATENATE(\"1/1/\",$AK$12)","v":"1/1/arn"},{"$f":"(ISERROR(VLOOKUP($AB15,'GPU001'!$A:$J,6,FALSE)))","v":true},{"$f":"IF($AI15,\"\",VLOOKUP($AH15,'GPU001'!$B:$J,5,FALSE))","v":"KOR"},{"$f":"IF($AI15,\"\",VLOOKUP($AH15,'GPU001'!$B:$J,6,FALSE))","v":"DE"},{"$f":"IF($AI15,\"\",VLOOKUP($AH15,'GPU001'!$B:$J,7,FALSE))","v":213},null,{"$f":"CONCATENATE(\"1/1/\",$AE$12)","v":"1/1/1a"},{"$f":"(ISERROR(VLOOKUP($AH15,'GPU001'!$B:$J,5,FALSE)))","v":false},{"$f":"IF($AC15,\"\",VLOOKUP($AB15,'GPU001'!$A:$J,5,FALSE))","v":""},{"$f":"IF($AC15,\"\",VLOOKUP($AB15,'GPU001'!$A:$J,7,FALSE))","v":""},{"$f":"IF($AC15,\"\",VLOOKUP($AB15,'GPU001'!$A:$J,8,FALSE))","v":""},null,{"$f":"CONCATENATE(\"1/1/\",$AQ$12)","v":"1/1/10"},{"$f":"(ISERROR(VLOOKUP($AN15,'GPU001'!$C:$J,4,FALSE)))","v":true},{"$f":"IF($AO15,\"\",VLOOKUP($AN15,'GPU001'!$C:$J,4,FALSE))","v":""},{"$f":"IF($AO15,\"\",VLOOKUP($AN15,'GPU001'!$C:$J,3,FALSE))","v":""},{"$f":"IF($AO15,\"\",VLOOKUP($AN15,'GPU001'!$C:$J,5,FALSE))","v":""}]
[{"$f":"CONCATENATE(\"1/2/\",$G$3)","v":"1/2/"},{"$f":"(ISERROR(VLOOKUP($A16,'GPU001'!$A:$J,6,FALSE)))","v":true},null,"Mo 2",{"$f":"IF($B16,\"\",VLOOKUP($A16,'GPU001'!$A:$J,5,FALSE))","v":""},{"$f":"IF($B16,\"\",VLOOKUP($A16,'GPU001'!$A:$J,6,FALSE))","v":""},{"$f":"IF($B16,\"\",VLOOKUP($A16,'GPU001'!$A:$J,7,FALSE))","v":""},{"$f":"IF($B16,\"\",VLOOKUP($A16,'GPU001'!$A:$J,8,FALSE))","v":""},null,null,null,null,null,null,null,null,null,null,null,null,null,null,null,null,null,{"$f":"IF(IF(E16=\"\",FALSE,AND(ROW()>=$AK$1,ROW()<=$AL$1)),IF(AND(AND(ISBLANK(J16),ISBLANK(S16),ISBLANK(U16),ISBLANK(Q16)),OR(ISBLANK(M16),ISBLANK(N16))),\"offen\",\"i.O.\"),\"\")","v":""},null,{"$f":"CONCATENATE(\"1/2/\",$AK$12)","v":"1/2/arn"},{"$f":"(ISERROR(VLOOKUP($AB16,'GPU001'!$A:$J,6,FALSE)))","v":true},{"$f":"IF($AI16,\"\",VLOOKUP($AH16,'GPU001'!$B:$J,5,FALSE))","v":"KOR"},{"$f":"IF($AI16,\"\",VLOOKUP($AH16,'GPU001'!$B:$J,6,FALSE))","v":"DE"},{"$f":"IF($AI16,\"\",VLOOKUP($AH16,'GPU001'!$B:$J,7,FALSE))","v":213},null,{"$f":"CONCATENATE(\"1/2/\",$AE$12)","v":"1/2/1a"},{"$f":"(ISERROR(VLOOKUP($AH16,'GPU001'!$B:$J,5,FALSE)))","v":false},{"$f":"IF($AC16,\"\",VLOOKUP($AB16,'GPU001'!$A:$J,5,FALSE))","v":""},{"$f":"IF($AC16,\"\",VLOOKUP($AB16,'GPU001'!$A:$J,7,FALSE))","v":""},{"$f":"IF($AC16,\"\",VLOOKUP($AB16,'GPU001'!$A:$J,8,FALSE))","v":""},null,{"$f":"CONCATENATE(\"1/2/\",$AQ$12)","v":"1/2/10"},{"$f":"(ISERROR(VLOOKUP($AN16,'GPU001'!$C:$J,4,FALSE)))","v":true},{"$f":"IF($AO16,\"\",VLOOKUP($AN16,'GPU001'!$C:$J,4,FALSE))","v":""},{"$f":"IF($AO16,\"\",VLOOKUP($AN16,'GPU001'!$C:$J,3,FALSE))","v":""},{"$f":"IF($AO16,\"\",VLOOKUP($AN16,'GPU001'!$C:$J,5,FALSE))","v":""}]
[{"$f":"CONCATENATE(\"1/3/\",$G$3)","v":"1/3/"},{"$f":"(ISERROR(VLOOKUP($A17,'GPU001'!$A:$J,6,FALSE)))","v":true},null,"Mo 3",{"$f":"IF($B17,\"\",VLOOKUP($A17,'GPU001'!$A:$J,5,FALSE))","v":""},{"$f":"IF($B17,\"\",VLOOKUP($A17,'GPU001'!$A:$J,6,FALSE))","v":""},{"$f":"IF($B17,\"\",VLOOKUP($A17,'GPU001'!$A:$J,7,FALSE))","v":""},{"$f":"IF($B17,\"\",VLOOKUP($A17,'GPU001'!$A:$J,8,FALSE))","v":""},null,null,null,null,null,null,null,null,null,null,null,null,null,null,null,null,null,"",null,{"$f":"CONCATENATE(\"1/3/\",$AK$12)","v":"1/3/arn"},{"$f":"(ISERROR(VLOOKUP($AB17,'GPU001'!$A:$J,6,FALSE)))","v":true},{"$f":"IF($AI17,\"\",VLOOKUP($AH17,'GPU001'!$B:$J,5,FALSE))","v":"GRM"},{"$f":"IF($AI17,\"\",VLOOKUP($AH17,'GPU001'!$B:$J,6,FALSE))","v":"SH"},{"$f":"IF($AI17,\"\",VLOOKUP($AH17,'GPU001'!$B:$J,7,FALSE))","v":"TS2"},null,{"$f":"CONCATENATE(\"1/3/\",$AE$12)","v":"1/3/1a"},{"$f":"(ISERROR(VLOOKUP($AH17,'GPU001'!$B:$J,5,FALSE)))","v":false},{"$f":"IF($AC17,\"\",VLOOKUP($AB17,'GPU001'!$A:$J,5,FALSE))","v":""},{"$f":"IF($AC17,\"\",VLOOKUP($AB17,'GPU001'!$A:$J,7,FALSE))","v":""},{"$f":"IF($AC17,\"\",VLOOKUP($AB17,'GPU001'!$A:$J,8,FALSE))","v":""},null,{"$f":"CONCATENATE(\"1/3/\",$AQ$12)","v":"1/3/10"},{"$f":"(ISERROR(VLOOKUP($AN17,'GPU001'!$C:$J,4,FALSE)))","v":true},{"$f":"IF($AO17,\"\",VLOOKUP($AN17,'GPU001'!$C:$J,4,FALSE))","v":""},{"$f":"IF($AO17,\"\",VLOOKUP($AN17,'GPU001'!$C:$J,3,FALSE))","v":""},{"$f":"IF($AO17,\"\",VLOOKUP($AN17,'GPU001'!$C:$J,5,FALSE))","v":""}]
[{"$f":"CONCATENATE(\"1/4/\",$G$3)","v":"1/4/"},{"$f":"(ISERROR(VLOOKUP($A18,'GPU001'!$A:$J,6,FALSE)))","v":true},null,"Mo 4",{"$f":"IF($B18,\"\",VLOOKUP($A18,'GPU001'!$A:$J,5,FALSE))","v":""},{"$f":"IF($B18,\"\",VLOOKUP($A18,'GPU001'!$A:$J,6,FALSE))","v":""},{"$f":"IF($B18,\"\",VLOOKUP($A18,'GPU001'!$A:$J,7,FALSE))","v":""},{"$f":"IF($B18,\"\",VLOOKUP($A18,'GPU001'!$A:$J,8,FALSE))","v":""},null,null,null,null,null,null,null,null,null,null,null,null,null,null,null,null,null,"",null,{"$f":"CONCATENATE(\"1/4/\",$AK$12)","v":"1/4/arn"},{"$f":"(ISERROR(VLOOKUP($AB18,'GPU001'!$A:$J,6,FALSE)))","v":true},{"$f":"IF($AI18,\"\",VLOOKUP($AH18,'GPU001'!$B:$J,5,FALSE))","v":"GRM"},{"$f":"IF($AI18,\"\",VLOOKUP($AH18,'GPU001'!$B:$J,6,FALSE))","v":"SH"},{"$f":"IF($AI18,\"\",VLOOKUP($AH18,'GPU001'!$B:$J,7,FALSE))","v":"TS2"},null,{"$f":"CONCATENATE(\"1/4/\",$AE$12)","v":"1/4/1a"},{"$f":"(ISERROR(VLOOKUP($AH18,'GPU001'!$B:$J,5,FALSE)))","v":false},{"$f":"IF($AC18,\"\",VLOOKUP($AB18,'GPU001'!$A:$J,5,FALSE))","v":""},{"$f":"IF($AC18,\"\",VLOOKUP($AB18,'GPU001'!$A:$J,7,FALSE))","v":""},{"$f":"IF($AC18,\"\",VLOOKUP($AB18,'GPU001'!$A:$J,8,FALSE))","v":""},null,{"$f":"CONCATENATE(\"1/4/\",$AQ$12)","v":"1/4/10"},{"$f":"(ISERROR(VLOOKUP($AN18,'GPU001'!$C:$J,4,FALSE)))","v":true},{"$f":"IF($AO18,\"\",VLOOKUP($AN18,'GPU001'!$C:$J,4,FALSE))","v":""},{"$f":"IF($AO18,\"\",VLOOKUP($AN18,'GPU001'!$C:$J,3,FALSE))","v":""},{"$f":"IF($AO18,\"\",VLOOKUP($AN18,'GPU001'!$C:$J,5,FALSE))","v":""}]
[{"$f":"CONCATENATE(\"1/5/\",$G$3)","v":"1/5/"},{"$f":"(ISERROR(VLOOKUP($A19,'GPU001'!$A:$J,6,FALSE)))","v":true},null,"Mo 5",{"$f":"IF($B19,\"\",VLOOKUP($A19,'GPU001'!$A:$J,5,FALSE))","v":""},{"$f":"IF($B19,\"\",VLOOKUP($A19,'GPU001'!$A:$J,6,FALSE))","v":""},{"$f":"IF($B19,\"\",VLOOKUP($A19,'GPU001'!$A:$J,7,FALSE))","v":""},{"$f":"IF($B19,\"\",VLOOKUP($A19,'GPU001'!$A:$J,8,FALSE))","v":""},null,null,null,null,null,null,null,null,null,null,null,null,null,null,null,null,null,"",null,{"$f":"CONCATENATE(\"1/5/\",$AK$12)","v":"1/5/arn"},{"$f":"(ISERROR(VLOOKUP($AB19,'GPU001'!$A:$J,6,FALSE)))","v":true},{"$f":"IF($AI19,\"\",VLOOKUP($AH19,'GPU001'!$B:$J,5,FALSE))","v":""},{"$f":"IF($AI19,\"\",VLOOKUP($AH19,'GPU001'!$B:$J,6,FALSE))","v":""},{"$f":"IF($AI19,\"\",VLOOKUP($AH19,'GPU001'!$B:$J,7,FALSE))","v":""},null,{"$f":"CONCATENATE(\"1/5/\",$AE$12)","v":"1/5/1a"},{"$f":"(ISERROR(VLOOKUP($AH19,'GPU001'!$B:$J,5,FALSE)))","v":true},{"$f":"IF($AC19,\"\",VLOOKUP($AB19,'GPU001'!$A:$J,5,FALSE))","v":""},{"$f":"IF($AC19,\"\",VLOOKUP($AB19,'GPU001'!$A:$J,7,FALSE))","v":""},{"$f":"IF($AC19,\"\",VLOOKUP($AB19,'GPU001'!$A:$J,8,FALSE))","v":""},null,{"$f":"CONCATENATE(\"1/5/\",$AQ$12)","v":"1/5/10"},{"$f":"(ISERROR(VLOOKUP($AN19,'GPU001'!$C:$J,4,FALSE)))","v":true},{"$f":"IF($AO19,\"\",VLOOKUP($AN19,'GPU001'!$C:$J,4,FALSE))","v":""},{"$f":"IF($AO19,\"\",VLOOKUP($AN19,'GPU001'!$C:$J,3,FALSE))","v":""},{"$f":"IF($AO19,\"\",VLOOKUP($AN19,'GPU001'!$C:$J,5,FALSE))","v":""}]
[{"$f":"CONCATENATE(\"1/6/\",$G$3)","v":"1/6/"},{"$f":"(ISERROR(VLOOKUP($A20,'GPU001'!$A:$J,6,FALSE)))","v":true},null,"Mo 6",{"$f":"IF($B20,\"\",VLOOKUP($A20,'GPU001'!$A:$J,5,FALSE))","v":""},{"$f":"IF($B20,\"\",VLOOKUP($A20,'GPU001'!$A:$J,6,FALSE))","v":""},{"$f":"IF($B20,\"\",VLOOKUP($A20,'GPU001'!$A:$J,7,FALSE))","v":""},{"$f":"IF($B20,\"\",VLOOKUP($A20,'GPU001'!$A:$J,8,FALSE))","v":""},null,null,null,null,null,null,null,null,null,null,null,null,null,null,null,null,null,"",null,{"$f":"CONCATENATE(\"1/6/\",$AK$12)","v":"1/6/arn"},{"$f":"(ISERROR(VLOOKUP($AB20,'GPU001'!$A:$J,6,FALSE)))","v":true},{"$f":"IF($AI20,\"\",VLOOKUP($AH20,'GPU001'!$B:$J,5,FALSE))","v":""},{"$f":"IF($AI20,\"\",VLOOKUP($AH20,'GPU001'!$B:$J,6,FALSE))","v":""},{"$f":"IF($AI20,\"\",VLOOKUP($AH20,'GPU001'!$B:$J,7,FALSE))","v":""},null,{"$f":"CONCATENATE(\"1/6/\",$AE$12)","v":"1/6/1a"},{"$f":"(ISERROR(VLOOKUP($AH20,'GPU001'!$B:$J,5,FALSE)))","v":true},{"$f":"IF($AC20,\"\",VLOOKUP($AB20,'GPU001'!$A:$J,5,FALSE))","v":""},{"$f":"IF($AC20,\"\",VLOOKUP($AB20,'GPU001'!$A:$J,7,FALSE))","v":""},{"$f":"IF($AC20,\"\",VLOOKUP($AB20,'GPU001'!$A:$J,8,FALSE))","v":""},null,{"$f":"CONCATENATE(\"1/6/\",$AQ$12)","v":"1/6/10"},{"$f":"(ISERROR(VLOOKUP($AN20,'GPU001'!$C:$J,4,FALSE)))","v":true},{"$f":"IF($AO20,\"\",VLOOKUP($AN20,'GPU001'!$C:$J,4,FALSE))","v":""},{"$f":"IF($AO20,\"\",VLOOKUP($AN20,'GPU001'!$C:$J,3,FALSE))","v":""},{"$f":"IF($AO20,\"\",VLOOKUP($AN20,'GPU001'!$C:$J,5,FALSE))","v":""}]
{"$rows_left_out":55}
{"sheet":"GPU001","index":2,"n_rows":2268,"n_cols":10,"rows_kept":2268,"cut":false,"hidden":true,"merged":[]}
[{"$f":"CONCATENATE($I1,\"/\",$J1,\"/\",$F1)","v":"2/7/STA"},{"$f":"CONCATENATE($I1,\"/\",$J1,\"/\",$E1)","v":"2/7/6A"},{"$f":"CONCATENATE($I1,\"/\",$J1,\"/\",$H1)","v":"2/7/N16"},2354,"6A","STA","EBI","N16",2,7]
["2/8/STA","2/8/6A","2/8/N16",2354,"6A","STA","EBI","N16",2,8]
["2/7/STA","2/7/6B","2/7/N16",2354,"6B","STA","EBI","N16",2,7]
["2/8/STA","2/8/6B","2/8/N16",2354,"6B","STA","EBI","N16",2,8]
["2/7/STA","2/7/6C","2/7/N16",2354,"6C","STA","EBI","N16",2,7]
["2/8/STA","2/8/6C","2/8/N16",2354,"6C","STA","EBI","N16",2,8]
["2/7/STA","2/7/6D","2/7/N16",2354,"6D","STA","EBI","N16",2,7]
["2/8/STA","2/8/6D","2/8/N16",2354,"6D","STA","EBI","N16",2,8]
["2/7/STA","2/7/6K","2/7/N16",2354,"6K","STA","EBI","N16",2,7]
["2/8/STA","2/8/6K","2/8/N16",2354,"6K","STA","EBI","N16",2,8]
["2/7/STA","2/7/6L","2/7/N16",2354,"6L","STA","EBI","N16",2,7]
["2/8/STA","2/8/6L","2/8/N16",2354,"6L","STA","EBI","N16",2,8]
["2/7/DIS","2/7/6A","2/7/106",2354,"6A","DIS","EGG",106,2,7]
["2/8/DIS","2/8/6A","2/8/106",2354,"6A","DIS","EGG",106,2,8]
["2/7/DIS","2/7/6B","2/7/106",2354,"6B","DIS","EGG",106,2,7]
["2/8/DIS","2/8/6B","2/8/106",2354,"6B","DIS","EGG",106,2,8]
["2/7/DIS","2/7/6C","2/7/106",2354,"6C","DIS","EGG",106,2,7]
["2/8/DIS","2/8/6C","2/8/106",2354,"6C","DIS","EGG",106,2,8]
["2/7/DIS","2/7/6D","2/7/106",2354,"6D","DIS","EGG",106,2,7]
["2/8/DIS","2/8/6D","2/8/106",2354,"6D","DIS","EGG",106,2,8]
{"$rows_left_out":2249}
{"sheet":"GPU004","index":3,"n_rows":98,"n_cols":2,"rows_kept":98,"cut":false,"hidden":true,"merged":[]}
["AMI","AMICO FLAVIA"]
["ARN","ARNET MATTHIAS"]
["BAE","BALMER EVELYNE"]
["BAS","BASCHUNG-SCHNYDER FRANZISKA"]
["BAU","BAUMGARTNER MIRJAM"]
["BEL","BELTRANI MARCO"]
["BEM","BERGER MONIKA"]
["BIL","BILAND SUSANNA"]
["BLA","BLÄTTLER BENNO"]
["BLU","BLUM MICHAEL"]
["BRE","BRENTINI FABRIZIO"]
["BRG","BREGNARD THIERRY"]
["BRN","BRÜNDLER URSULA"]
["BRO","BRODER BARBARA"]
["BUA","BÜCHEL ADRIAN"]
["BUD","BUDMIGER SAMUEL"]
["BUR","BURKARD NICOLE"]
["CAS","CASPARIS CLAUDINE"]
["CHI","CHIANTESE STEFANO"]
["CLE","CLEMENS THOMAS"]
{"$rows_left_out":78}